{"text_format":"1","workbook":"xlsx","n_sheets":6,"sheets":["Wire-to-Air","Fan with Regulated Motor","Fan without motor","AMCA 208 Tables","AMCA 207 Tables","PSW_Sheet"],"not_rendered":{"charts":0,"images":2,"macros":1,"external_links":1,"defined_names":16,"comments":0,"pivot_tables":0},"unopened":[],"bounds":{"document_bytes":16777216,"sheet_cells":100000,"rows_first":2000,"rows_last":500,"rows_between":2000,"halvings":0,"cell_chars":16384,"cell_head_chars":4096},"cells_cut":0,"cells_raw":0,"read":"whole","date_system":"1900"}

{"sheet":"Wire-to-Air","index":0,"n_rows":20,"n_cols":18,"rows_kept":20,"cut":false,"hidden":false,"merged":[[8,16,8,17],[9,3,10,5],[9,6,10,11],[9,12,9,15],[10,12,10,15],[10,16,10,17]]}
["FEI Calculations per AMCA 208 draft SCD-4 Dated 4/25/17"]
[]
["Instructions:"]
["Please fill the blue colored cells."]
[]
["Please copy down from row 17."]
[]
[]
[null,null,null,null,null,null,null,null,null,null,null,null,null,null,null,null,"Wi Measured"]
[null,null,null,"AMCA 208 Annex A",null,null,"Duty Point",null,null,null,null,null,"FEPref Calculation"]
[null,null,null,null,null,null,null,null,null,null,null,null,"Section 5.2",null,null,null,"Section 5.3.1"]
["Qty\nSold","Model","Size","Fan Category","Test\nConfig","FEI Pressure Basis","Impeller Dia\n(in.)","Outlet Area \n(ft²)","Air Density\n(lb/ft³)","Airflow\n(cfm)","Fan\nStatic\nPressure\n(in. wg)","Fan\nTotal\nPressure\n(in. wg)","Hi,ref\n(bhp)","ηtrans,ref","ηmtr,ref","FEPref\n(kW)","Wi\n(kW)","FEI"]
[null,null,null,"Circulating",{"$f":"VLOOKUP(D13,'AMCA 208 Tables'!$A$17:$G$27,5,FALSE)","v":"E"},{"$f":"VLOOKUP(D13,'AMCA 208 Tables'!$A$17:$G$27,6,FALSE)","v":"Total"},30,8.3550000000000004,9.3299999999999994E-2,20000,4,{"$f":"IF(F13=\"Total\",K13+(J13/(1097.8*H13))^2*I13,\"-\")","v":4.4436109664257355},{"$f":"IF(D13=\"Circulating\",($J13+'AMCA 208 Tables'!$I$3)*($L13+'AMCA 208 Tables'!$I$4*(IF($I13=0,0.075,$I13)/0.075))/(6343*'AMCA 208 Tables'!$I$5),(IF(F13=\"Total\",($J13+'AMCA 208 Tables'!$F$3)*($L13+'AMCA 208 Tables'!$F$4*(IF($I13=0,0.075,$I13)/0.075))/(6343*'AMCA 208 Tables'!$F$5),($J13+'AMCA 208 Tables'!$F$3)*($K13+'AMCA 208 Tables'!$F$4*(IF($I13=0,0.075,$I13)/0.075))/(6343*'AMCA 208 Tables'!$F$6))))","v":63.09394402937351},{"$f":"0.96*(M13/(M13+2.2))^0.05","v":0.95835623286199789},{"$f":"'AMCA 208 Tables'!F$9*(LOG(M13/N13*0.746))^4+'AMCA 208 Tables'!F$10*(LOG(M13/N13*0.746))^3+'AMCA 208 Tables'!F$11*(LOG(M13/N13*0.746))^2+'AMCA 208 Tables'!F$12*LOG(M13/N13*0.746)+'AMCA 208 Tables'!F$13","v":0.94877850976503697},{"$f":"M13*(1/N13)*(1/O13)*0.746","v":51.764818161080541},18,{"$f":"IF(Q13>0,P13/Q13,\"-\")","v":2.8758232311711414}]
[null,null,null,"Circulating",{"$f":"VLOOKUP(D14,'AMCA 208 Tables'!$A$17:$G$27,5,FALSE)","v":"E"},{"$f":"VLOOKUP(D14,'AMCA 208 Tables'!$A$17:$G$27,6,FALSE)","v":"Total"},30,8.3550000000000004,7.4999999999999997E-2,20000,0.125,{"$f":"IF(F14=\"Total\",K14+(J14/(1097.8*H14))^2*I14,\"-\")","v":0.4816004553261542},{"$f":"IF(D14=\"Circulating\",($J14+'AMCA 208 Tables'!$I$3)*($L14+'AMCA 208 Tables'!$I$4*(IF($I14=0,0.075,$I14)/0.075))/(6343*'AMCA 208 Tables'!$I$5),(IF(F14=\"Total\",($J14+'AMCA 208 Tables'!$F$3)*($L14+'AMCA 208 Tables'!$F$4*(IF($I14=0,0.075,$I14)/0.075))/(6343*'AMCA 208 Tables'!$F$5),($J14+'AMCA 208 Tables'!$F$3)*($K14+'AMCA 208 Tables'!$F$4*(IF($I14=0,0.075,$I14)/0.075))/(6343*'AMCA 208 Tables'!$F$6))))","v":6.8688382436313846},{"$f":"0.96*(M14/(M14+2.2))^0.05","v":0.94675545195522781},{"$f":"'AMCA 208 Tables'!F$9*(LOG(M14/N14*0.746))^4+'AMCA 208 Tables'!F$10*(LOG(M14/N14*0.746))^3+'AMCA 208 Tables'!F$11*(LOG(M14/N14*0.746))^2+'AMCA 208 Tables'!F$12*LOG(M14/N14*0.746)+'AMCA 208 Tables'!F$13","v":0.91244256722545658},{"$f":"M14*(1/N14)*(1/O14)*0.746","v":5.9316943455525113},2.25,{"$f":"IF(Q14>0,P14/Q14,\"-\")","v":2.6363085980233385}]
[null,null,null,"Circulating",{"$f":"VLOOKUP(D15,'AMCA 208 Tables'!$A$17:$G$27,5,FALSE)","v":"E"},{"$f":"VLOOKUP(D15,'AMCA 208 Tables'!$A$17:$G$27,6,FALSE)","v":"Total"},36,7.07,7.4999999999999997E-2,20000,0.25,0.74800760428667268,{"$f":"IF(D15=\"Circulating\",($J15+'AMCA 208 Tables'!$I$3)*($L15+'AMCA 208 Tables'!$I$4*(IF($I15=0,0.075,$I15)/0.075))/(6343*'AMCA 208 Tables'!$I$5),(IF(F15=\"Total\",($J15+'AMCA 208 Tables'!$F$3)*($L15+'AMCA 208 Tables'!$F$4*(IF($I15=0,0.075,$I15)/0.075))/(6343*'AMCA 208 Tables'!$F$5),($J15+'AMCA 208 Tables'!$F$3)*($K15+'AMCA 208 Tables'!$F$4*(IF($I15=0,0.075,$I15)/0.075))/(6343*'AMCA 208 Tables'!$F$6))))","v":10.648854546082378},{"$f":"0.96*(M15/(M15+2.2))^0.05","v":0.95102767941743638},{"$f":"'AMCA 208 Tables'!F$9*(LOG(M15/N15*0.746))^4+'AMCA 208 Tables'!F$10*(LOG(M15/N15*0.746))^3+'AMCA 208 Tables'!F$11*(LOG(M15/N15*0.746))^2+'AMCA 208 Tables'!F$12*LOG(M15/N15*0.746)+'AMCA 208 Tables'!F$13","v":0.92185560988215975},{"$f":"M15*(1/N15)*(1/O15)*0.746","v":9.0611988756064576},null,"-"]
{"$rows_left_out":6}
{"sheet":"Fan with Regulated Motor","index":1,"n_rows":16,"n_cols":27,"rows_kept":16,"cut":false,"hidden":false,"merged":[[8,16,8,26],[9,3,10,5],[9,6,10,11],[9,12,9,15],[9,18,9,26],[10,12,10,15],[10,18,10,26]]}
["FEI Calculations "]
[]
["Instructions:"]
["Please fill the blue colored cells."]
[]
["Only ODP and TEFC motors are considered."]
["Please copy down from row 17."]
["Assumption: VFD capacity is same as motor capacity when VFD capacity is not given."]
[null,null,null,null,null,null,null,null,null,null,null,null,null,null,null,null,"Hi Measured"]
[null,null,null,"AMCA 208 Annex A",null,null,"Duty Point",null,null,null,null,null,"FEPref Calculation",null,null,null,null,null,"Fan paired with regulated motor (US Regulation only)"]
[null,null,null,null,null,null,null,null,null,null,null,null,"Section 5.2",null,null,null,null,null,"Section 5.3.3  (uses AMCA 207)"]
["Qty\nSold","Model","Size","Fan Category","Test\nConfig","FEI Pressure Basis","Impeller Dia\n(in.)","Outlet Area \n(ft²)","Air Density\n(lb/ft³)","Airflow\n(cfm)","Fan\nStatic\nPressure\n(in. wg)","Fan\nTotal\nPressure\n(in. wg)","Hi,ref\n(bhp)","ηtrans,ref","ηmtr,ref","FEPref\n(kW)","Hi,act\n(bhp)","Drive Type","Motor Size\n(hp)","Motor Encl.","No.\nPoles","Include VFD?","VFD Capacity (hp)","ηtrans,act","ηmtr,act","FEPact\n(kW)","FEI"]
[null,"ABC",300,"Centrifugal PRV Exhaust",{"$f":"VLOOKUP(D13,'AMCA 208 Tables'!$A$17:$G$27,5,FALSE)","v":"A or C"},{"$f":"VLOOKUP(D13,'AMCA 208 Tables'!$A$17:$G$27,6,FALSE)","v":"Static"},31.5,7.88,7.4999999999999997E-2,5000,2,{"$f":"IF(F13=\"Total\",K13+(J13/(1097.8*H13))^2*I13,\"-\")","v":"-"},{"$f":"IF(D13=\"Circulating\",($J13+'AMCA 208 Tables'!$I$3)*($L13+'AMCA 208 Tables'!$I$4*(IF($I13=0,0.075,$I13)/0.075))/(6343*'AMCA 208 Tables'!$I$5),(IF(F13=\"Total\",($J13+'AMCA 208 Tables'!$F$3)*($L13+'AMCA 208 Tables'!$F$4*(IF($I13=0,0.075,$I13)/0.075))/(6343*'AMCA 208 Tables'!$F$5),($J13+'AMCA 208 Tables'!$F$3)*($K13+'AMCA 208 Tables'!$F$4*(IF($I13=0,0.075,$I13)/0.075))/(6343*'AMCA 208 Tables'!$F$6))))","v":3.3107362446791742},{"$f":"0.96*(M13/(M13+2.2))^0.05","v":0.9358515865407705},{"$f":"'AMCA 208 Tables'!F$9*(LOG(M13/N13*0.746))^4+'AMCA 208 Tables'!F$10*(LOG(M13/N13*0.746))^3+'AMCA 208 Tables'!F$11*(LOG(M13/N13*0.746))^2+'AMCA 208 Tables'!F$12*LOG(M13/N13*0.746)+'AMCA 208 Tables'!F$13","v":0.89215084613118467},{"$f":"M13*(1/N13)*(1/O13)*0.746","v":2.9581360094718523},4.04,"V-Belt",3,"ODP",4,"No",10,{"$f":"IF($R13=\"Direct\",1,IF($R13=\"Coupling\",0.98,IF($R13=\"V-Belt\",0.96*(Q13/(Q13+2.2))^0.05,IF($R13=\"Synch Belt\",IF(Q13<=1.34,0.94,IF(Q13<=6.7,(0.00746*Q13+0.93),0.98)),\"Missing Transmission Type\"))))","v":0.93935785603122302},{"$f":"IF(Q13/X13>1.5*S13, \"Overload\", IF(AND(V13=\"Yes\",ISNUMBER(W13)),EtaMtrAct(Q13/X13,S13,W13,T13,U13,V13),EtaMtrAct(Q13/X13,S13,S13,T13,U13,V13)))","v":0.87656804504289032},{"$f":"IF(Q13/X13>1.5*S13, \"Overload\",Q13*(1/X13)*(1/Y13)*0.746)","v":3.6601887868543042},{"$f":"IF(Q13/X13>1.5*S13, \"Overload\",P13/Z13)","v":0.80819219492068306}]
[null,"ABC",540,"Centrifugal Unhoused",{"$f":"VLOOKUP(D14,'AMCA 208 Tables'!$A$17:$G$27,5,FALSE)","v":"A"},{"$f":"VLOOKUP(D14,'AMCA 208 Tables'!$A$17:$G$27,6,FALSE)","v":"Static"},54,null,7.4999999999999997E-2,40131,0.125,{"$f":"IF(F14=\"Total\",K14+(J14/(1097.8*H14))^2*I14,\"-\")","v":"-"},{"$f":"IF(D14=\"Circulating\",($J14+'AMCA 208 Tables'!$I$3)*($L14+'AMCA 208 Tables'!$I$4*(IF($I14=0,0.075,$I14)/0.075))/(6343*'AMCA 208 Tables'!$I$5),(IF(F14=\"Total\",($J14+'AMCA 208 Tables'!$F$3)*($L14+'AMCA 208 Tables'!$F$4*(IF($I14=0,0.075,$I14)/0.075))/(6343*'AMCA 208 Tables'!$F$5),($J14+'AMCA 208 Tables'!$F$3)*($K14+'AMCA 208 Tables'!$F$4*(IF($I14=0,0.075,$I14)/0.075))/(6343*'AMCA 208 Tables'!$F$6))))","v":5.5704516790162391},{"$f":"0.96*(M14/(M14+2.2))^0.05","v":0.94415531090047311},{"$f":"'AMCA 208 Tables'!F$9*(LOG(M14/N14*0.746))^4+'AMCA 208 Tables'!F$10*(LOG(M14/N14*0.746))^3+'AMCA 208 Tables'!F$11*(LOG(M14/N14*0.746))^2+'AMCA 208 Tables'!F$12*LOG(M14/N14*0.746)+'AMCA 208 Tables'!F$13","v":0.90728895307871316},{"$f":"M14*(1/N14)*(1/O14)*0.746","v":4.8510994202537487},2.762,"V-Belt",3,"ODP",4,"No",7.5,{"$f":"IF($R14=\"Direct\",1,IF($R14=\"Coupling\",0.98,IF($R14=\"V-Belt\",0.96*(Q14/(Q14+2.2))^0.05,IF($R14=\"Synch Belt\",IF(Q14<=1.34,0.94,IF(Q14<=6.7,(0.00746*Q14+0.93),0.98)),\"Missing Transmission Type\"))))","v":0.93228689348786287},{"$f":"IF(Q14/X14>1.5*S14, \"Overload\", IF(AND(V14=\"Yes\",ISNUMBER(W14)),EtaMtrAct(Q14/X14,S14,W14,T14,U14,V14),EtaMtrAct(Q14/X14,S14,S14,T14,U14,V14)))","v":0.89512472536877608},{"$f":"IF(Q14/X14>1.5*S14, \"Overload\",Q14*(1/X14)*(1/Y14)*0.746)","v":2.4690470703111083},{"$f":"IF(Q14/X14>1.5*S14, \"Overload\",P14/Z14)","v":1.964765872058686}]
[null,"ABC",600,"Centrifugal Unhoused",{"$f":"VLOOKUP(D15,'AMCA 208 Tables'!$A$17:$G$27,5,FALSE)","v":"A"},{"$f":"VLOOKUP(D15,'AMCA 208 Tables'!$A$17:$G$27,6,FALSE)","v":"Static"},60,null,7.4999999999999997E-2,39858,0.125,"-",{"$f":"IF(D15=\"Circulating\",($J15+'AMCA 208 Tables'!$I$3)*($L15+'AMCA 208 Tables'!$I$4*(IF($I15=0,0.075,$I15)/0.075))/(6343*'AMCA 208 Tables'!$I$5),(IF(F15=\"Total\",($J15+'AMCA 208 Tables'!$F$3)*($L15+'AMCA 208 Tables'!$F$4*(IF($I15=0,0.075,$I15)/0.075))/(6343*'AMCA 208 Tables'!$F$5),($J15+'AMCA 208 Tables'!$F$3)*($K15+'AMCA 208 Tables'!$F$4*(IF($I15=0,0.075,$I15)/0.075))/(6343*'AMCA 208 Tables'!$F$6))))","v":5.5327920542330133},{"$f":"0.96*(M15/(M15+2.2))^0.05","v":0.94406442793977363},{"$f":"'AMCA 208 Tables'!F$9*(LOG(M15/N15*0.746))^4+'AMCA 208 Tables'!F$10*(LOG(M15/N15*0.746))^3+'AMCA 208 Tables'!F$11*(LOG(M15/N15*0.746))^2+'AMCA 208 Tables'!F$12*LOG(M15/N15*0.746)+'AMCA 208 Tables'!F$13","v":0.90711396454526161},{"$f":"M15*(1/N15)*(1/O15)*0.746","v":4.8196964726572036},4.04,"V-Belt",5,"TEFC",4,"No",5,0.93935785603122302,{"$f":"IF(Q15/X15>1.5*S15, \"Overload\", IF(AND(V15=\"Yes\",ISNUMBER(W15)),EtaMtrAct(Q15/X15,S15,W15,T15,U15,V15),EtaMtrAct(Q15/X15,S15,S15,T15,U15,V15)))","v":0.89977200569412685},{"$f":"IF(Q15/X15>1.5*S15, \"Overload\",Q15*(1/X15)*(1/Y15)*0.746)","v":3.5657972342734432},{"$f":"IF(Q15/X15>1.5*S15, \"Overload\",P15/Z15)","v":1.3516462535591292}]
{"$rows_left_out":2}
{"sheet":"Fan without motor","index":2,"n_rows":28,"n_cols":22,"rows_kept":28,"cut":false,"hidden":false,"merged":[[10,22,10,23],[8,16,8,21],[9,3,10,5],[9,6,10,11],[9,18,9,21],[10,18,10,21],[9,12,9,15],[10,12,10,15]]}
["FEI Calculations "]
[]
["Instructions:"]
["Please fill the blue colored cells."]
[]
["Only ODP and TEFC motors are considered."]
["Please copy down from row 17."]
[]
[null,null,null,null,null,null,null,null,null,null,null,null,null,null,null,null,"Hi Measured"]
[null,null,null,"AMCA 208 Annex A",null,null,"Duty Point",null,null,null,null,null,"FEPref Calculation",null,null,null,null,null,"Fan with unregulated or w/o motor"]
[null,null,null,null,null,null,null,null,null,null,null,null,"Section 5.2",null,null,null,null,null,"Section 5.3.4  (default motor efficiency)"]
["Qty\nSold","Model","Size","Fan Category","Test\nConfig","FEI Pressure Basis","Impeller Dia\n(in.)","Outlet Area \n(ft²)","Air Density\n(lb/ft³)","Airflow\n(cfm)","Fan\nStatic\nPressure\n(in. wg)","Fan\nTotal\nPressure\n(in. wg)","Hi,ref\n(bhp)","ηtrans,ref","ηmtr,ref","FEPref\n(kW)","Hi,act\n(bhp)","Drive Type","ηtrans,def","ηmtr,def","FEPact\n(kW)","FEI"]
[null,"ABC",300,"Centrifugal PRV Exhaust",{"$f":"VLOOKUP(D13,'AMCA 208 Tables'!$A$17:$G$27,5,FALSE)","v":"A or C"},{"$f":"VLOOKUP(D13,'AMCA 208 Tables'!$A$17:$G$27,6,FALSE)","v":"Static"},31.5,7.88,7.4999999999999997E-2,5000,2,{"$f":"IF(F13=\"Total\",K13+(J13/(1097.8*H13))^2*I13,\"-\")","v":"-"},{"$f":"IF(D13=\"Circulating\",($J13+'AMCA 208 Tables'!$I$3)*($L13+'AMCA 208 Tables'!$I$4*(IF($I13=0,0.075,$I13)/0.075))/(6343*'AMCA 208 Tables'!$I$5),(IF(F13=\"Total\",($J13+'AMCA 208 Tables'!$F$3)*($L13+'AMCA 208 Tables'!$F$4*(IF($I13=0,0.075,$I13)/0.075))/(6343*'AMCA 208 Tables'!$F$5),($J13+'AMCA 208 Tables'!$F$3)*($K13+'AMCA 208 Tables'!$F$4*(IF($I13=0,0.075,$I13)/0.075))/(6343*'AMCA 208 Tables'!$F$6))))","v":3.3107362446791742},{"$f":"0.96*(M13/(M13+2.2))^0.05","v":0.9358515865407705},{"$f":"'AMCA 208 Tables'!F$9*(LOG(M13/N13*0.746))^4+'AMCA 208 Tables'!F$10*(LOG(M13/N13*0.746))^3+'AMCA 208 Tables'!F$11*(LOG(M13/N13*0.746))^2+'AMCA 208 Tables'!F$12*LOG(M13/N13*0.746)+'AMCA 208 Tables'!F$13","v":0.89215084613118467},{"$f":"M13*(1/N13)*(1/O13)*0.746","v":2.9581360094718523},2.4700000000000002,"V-Belt",{"$f":"IF($R13=\"Direct\",1,IF($R13=\"Coupling\",0.98,IF($R13=\"V-Belt\",0.96*(Q13/(Q13+2.2))^0.05,IF($R13=\"Synch Belt\",IF(Q13<=1.34,0.94,IF(Q13<=6.7,(0.00746*Q13+0.93),0.98)),\"Missing Transmission Type\"))))","v":0.92990854110161847},{"$f":"'AMCA 208 Tables'!F$9*(LOG(Q13/S13*0.746))^4+'AMCA 208 Tables'!F$10*(LOG(Q13/S13*0.746))^3+'AMCA 208 Tables'!F$11*(LOG(Q13/S13*0.746))^2+'AMCA 208 Tables'!F$12*LOG(Q13/S13*0.746)+'AMCA 208 Tables'!F$13","v":0.88184517358271464},{"$f":"Q13*(1/S13)*(1/T13)*0.746","v":2.2470006690906228},{"$f":"P13/U13","v":1.3164820332114235}]
[null,"ABC",210,"Centrifugal PRV Exhaust",{"$f":"VLOOKUP(D14,'AMCA 208 Tables'!$A$17:$G$27,5,FALSE)","v":"A or C"},{"$f":"VLOOKUP(D14,'AMCA 208 Tables'!$A$17:$G$27,6,FALSE)","v":"Static"},38.380000000000003,null,7.4999999999999997E-2,5000,2,{"$f":"IF(F14=\"Total\",K14+(J14/(1097.8*H14))^2*I14,\"-\")","v":"-"},{"$f":"IF(D14=\"Circulating\",($J14+'AMCA 208 Tables'!$I$3)*($L14+'AMCA 208 Tables'!$I$4*(IF($I14=0,0.075,$I14)/0.075))/(6343*'AMCA 208 Tables'!$I$5),(IF(F14=\"Total\",($J14+'AMCA 208 Tables'!$F$3)*($L14+'AMCA 208 Tables'!$F$4*(IF($I14=0,0.075,$I14)/0.075))/(6343*'AMCA 208 Tables'!$F$5),($J14+'AMCA 208 Tables'!$F$3)*($K14+'AMCA 208 Tables'!$F$4*(IF($I14=0,0.075,$I14)/0.075))/(6343*'AMCA 208 Tables'!$F$6))))","v":3.3107362446791742},{"$f":"0.96*(M14/(M14+2.2))^0.05","v":0.9358515865407705},{"$f":"'AMCA 208 Tables'!F$9*(LOG(M14/N14*0.746))^4+'AMCA 208 Tables'!F$10*(LOG(M14/N14*0.746))^3+'AMCA 208 Tables'!F$11*(LOG(M14/N14*0.746))^2+'AMCA 208 Tables'!F$12*LOG(M14/N14*0.746)+'AMCA 208 Tables'!F$13","v":0.89215084613118467},{"$f":"M14*(1/N14)*(1/O14)*0.746","v":2.9581360094718523},2.9,"V-Belt",{"$f":"IF($R14=\"Direct\",1,IF($R14=\"Coupling\",0.98,IF($R14=\"V-Belt\",0.96*(Q14/(Q14+2.2))^0.05,IF($R14=\"Synch Belt\",IF(Q14<=1.34,0.94,IF(Q14<=6.7,(0.00746*Q14+0.93),0.98)),\"Missing Transmission Type\"))))","v":0.93328142915110823},{"$f":"'AMCA 208 Tables'!F$9*(LOG(Q14/S14*0.746))^4+'AMCA 208 Tables'!F$10*(LOG(Q14/S14*0.746))^3+'AMCA 208 Tables'!F$11*(LOG(Q14/S14*0.746))^2+'AMCA 208 Tables'!F$12*LOG(Q14/S14*0.746)+'AMCA 208 Tables'!F$13","v":0.88766920444449404},2.6113978842151044,{"$f":"P14/U14","v":1.1327787417431279}]
[null,"ABC",903,"Axial Inline",{"$f":"VLOOKUP(D15,'AMCA 208 Tables'!$A$17:$G$27,5,FALSE)","v":"B or D"},{"$f":"VLOOKUP(D15,'AMCA 208 Tables'!$A$17:$G$27,6,FALSE)","v":"Total"},13.65,1.036,7.4999999999999997E-2,8000,1,4.710866012657668,{"$f":"IF(D15=\"Circulating\",($J15+'AMCA 208 Tables'!$I$3)*($L15+'AMCA 208 Tables'!$I$4*(IF($I15=0,0.075,$I15)/0.075))/(6343*'AMCA 208 Tables'!$I$5),(IF(F15=\"Total\",($J15+'AMCA 208 Tables'!$F$3)*($L15+'AMCA 208 Tables'!$F$4*(IF($I15=0,0.075,$I15)/0.075))/(6343*'AMCA 208 Tables'!$F$5),($J15+'AMCA 208 Tables'!$F$3)*($K15+'AMCA 208 Tables'!$F$4*(IF($I15=0,0.075,$I15)/0.075))/(6343*'AMCA 208 Tables'!$F$6))))","v":10.071862708217067},0.95056364091516432,{"$f":"'AMCA 208 Tables'!F$9*(LOG(M15/N15*0.746))^4+'AMCA 208 Tables'!F$10*(LOG(M15/N15*0.746))^3+'AMCA 208 Tables'!F$11*(LOG(M15/N15*0.746))^2+'AMCA 208 Tables'!F$12*LOG(M15/N15*0.746)+'AMCA 208 Tables'!F$13","v":0.9207496870359807},8.5847142971758199,2.61,"Direct",1,{"$f":"'AMCA 208 Tables'!F$9*(LOG(Q15/S15*0.746))^4+'AMCA 208 Tables'!F$10*(LOG(Q15/S15*0.746))^3+'AMCA 208 Tables'!F$11*(LOG(Q15/S15*0.746))^2+'AMCA 208 Tables'!F$12*LOG(Q15/S15*0.746)+'AMCA 208 Tables'!F$13","v":0.8811650488474585},2.2096427934207159,{"$f":"P15/U15","v":3.8851140658286893}]
{"$rows_left_out":14}
{"sheet":"AMCA 208 Tables","index":3,"n_rows":30,"n_cols":9,"rows_kept":30,"cut":false,"hidden":false,"merged":[[1,4,1,5],[7,4,7,5],[1,7,1,8]]}
[]
[null,null,null,null,"FEPref Constants, section 5.2",null,null,"FEPref Constants, for ceiling fans"]
[null,null,null,null,"Q0",250,null,"Q0",16000]
[null,null,null,null,"P0",0.4,null,"P0",2.5000000000000001E-3]
[null,null,null,null,"η0,Total",0.66,null,"η0,Total",0.4]
[null,null,null,null,"η0,Static",0.6,null,"η0,Static"]
[]
[null,null,null,null,"Ref Mtr Constants, section 5.2"]
[null,null,null,null,"A",-3.8E-3]
[null,null,null,null,"B",2.58E-2]
[null,null,null,null,"C",-7.2599999999999998E-2]
[null,null,null,null,"D",0.12559999999999999]
[null,null,null,null,"E",0.85029999999999994]
[]
["AMCA 208 Annex A, Table A.2 (draft, for lookup)"]
{"$rows_left_out":16}
{"sheet":"AMCA 207 Tables","index":4,"n_rows":481,"n_cols":13,"rows_kept":481,"cut":false,"hidden":false,"merged":[[211,0,211,3],[244,0,244,12],[245,0,246,0],[447,0,447,3],[448,1,448,3],[362,0,362,4],[363,1,363,4],[387,0,387,4],[388,1,388,4],[417,0,417,4],[418,1,418,4],[339,1,339,4],[273,0,273,12],[274,0,275,0],[274,1,274,3],[337,0,337,4],[338,0,338,4],[245,1,245,3],[245,7,245,9],[245,10,245,12],[245,4,245,6],[274,7,274,9],[274,10,274,12],[306,0,307,2],[308,0,308,2],[309,1,309,2],[150,1,150,3],[150,4,150,6],[150,7,150,9],[121,10,121,12],[149,0,149,12],[150,10,150,12],[183,0,183,3],[120,0,120,12],[59,0,61,0],[59,1,59,3],[59,4,59,6],[59,7,59,9],[90,0,90,9],[91,0,92,0],[91,1,91,3],[91,4,91,6],[91,7,91,9],[121,4,121,6],[121,0,122,0],[121,1,121,3],[121,7,121,9],[150,0,151,0],[0,0,0,4],[1,1,1,4],[29,0,29,4],[30,1,30,4],[58,0,58,9]]}
["Table A1.  EISA 2007 Nominal Motor Effciency"]
["Motor Power (hp)","ODP"]
[null,2,4,6,8]
[1,0.77,0.85499999999999998,0.82499999999999996,0.755]
[1.5,0.84,0.86499999999999999,0.86499999999999999,0.78500000000000003]
[2,0.85499999999999998,0.86499999999999999,0.875,0.84]
[3,0.85499999999999998,0.89500000000000002,0.88500000000000001,0.85499999999999998]
[5,0.86499999999999999,0.89500000000000002,0.89500000000000002,0.86499999999999999]
[7.5,0.88500000000000001,0.91,0.90200000000000002,0.86499999999999999]
[10,0.89500000000000002,0.91700000000000004,0.91700000000000004,0.89500000000000002]
[15,0.90200000000000002,0.93,0.91700000000000004,0.89500000000000002]
[20,0.91,0.93,0.92400000000000004,0.90200000000000002]
[25,0.91700000000000004,0.93600000000000005,0.93,0.90200000000000002]
[30,0.91700000000000004,0.94099999999999995,0.93600000000000005,0.91700000000000004]
[40,0.92400000000000004,0.94099999999999995,0.94099999999999995,0.91700000000000004]
{"$rows_left_out":467}
{"sheet":"PSW_Sheet","index":5,"n_rows":0,"n_cols":0,"rows_kept":0,"cut":false,"hidden":true,"merged":[]}