{"text_format":"1","workbook":"xlsx","n_sheets":6,"sheets":["Wire-to-Air","Fan with Regulated Motor","Fan without motor","AMCA 208 Tables","AMCA 207 Tables","PSW_Sheet"],"not_rendered":{"charts":0,"images":2,"macros":1,"external_links":1,"defined_names":16,"comments":0,"pivot_tables":0},"unopened":[],"bounds":{"document_bytes":16777216,"sheet_cells":100000,"rows_first":2000,"rows_last":500,"rows_between":2000,"halvings":0,"cell_chars":16384,"cell_head_chars":4096},"cells_cut":0,"cells_raw":0,"read":"whole","date_system":"1900"}

{"sheet":"Wire-to-Air","index":0,"n_rows":20,"n_cols":18,"rows_kept":20,"cut":false,"hidden":false,"merged":[[8,16,8,17],[9,3,10,5],[9,6,10,11],[9,12,9,15],[10,12,10,15],[10,16,10,17]]}
["FEI Calculations per AMCA 208 draft SCD-4 Dated 4/25/17"]
[]
["Instructions:"]
["Please fill the blue colored cells."]
[]
["Please copy down from row 17."]
[]
[]
[null,null,null,null,null,null,null,null,null,null,null,null,null,null,null,null,"Wi Measured"]
[null,null,null,"AMCA 208 Annex A",null,null,"Duty Point",null,null,null,null,null,"FEPref Calculation"]
[null,null,null,null,null,null,null,null,null,null,null,null,"Section 5.2",null,null,null,"Section 5.3.1"]
["Qty\nSold","Model","Size","Fan Category","Test\nConfig","FEI Pressure Basis","Impeller Dia\n(in.)","Outlet Area \n(ft²)","Air Density\n(lb/ft³)","Airflow\n(cfm)","Fan\nStatic\nPressure\n(in. wg)","Fan\nTotal\nPressure\n(in. wg)","Hi,ref\n(bhp)","ηtrans,ref","ηmtr,ref","FEPref\n(kW)","Wi\n(kW)","FEI"]
[null,null,null,"Circulating",{"$f":"VLOOKUP(D13,'AMCA 208 Tables'!$A$17:$G$27,5,FALSE)","v":"E"},{"$f":"VLOOKUP(D13,'AMCA 208 Tables'!$A$17:$G$27,6,FALSE)","v":"Total"},30,8.3550000000000004,9.3299999999999994E-2,20000,4,{"$f":"IF(F13=\"Total\",K13+(J13/(1097.8*H13))^2*I13,\"-\")","v":4.4436109664257355},{"$f":"IF(D13=\"Circulating\",($J13+'AMCA 208 Tables'!$I$3)*($L13+'AMCA 208 Tables'!$I$4*(IF($I13=0,0.075,$I13)/0.075))/(6343*'AMCA 208 Tables'!$I$5),(IF(F13=\"Total\",($J13+'AMCA 208 Tables'!$F$3)*($L13+'AMCA 208 Tables'!$F$4*(IF($I13=0,0.075,$I13)/0.075))/(6343*'AMCA 208 Tables'!$F$5),($J13+'AMCA 208 Tables'!$F$3)*($K13+'AMCA 208 Tables'!$F$4*(IF($I13=0,0.075,$I13)/0.075))/(6343*'AMCA 208 Tables'!$F$6))))","v":63.09394402937351},{"$f":"0.96*(M13/(M13+2.2))^0.05","v":0.95835623286199789},{"$f":"'AMCA 208 Tables'!F$9*(LOG(M13/N13*0.746))^4+'AMCA 208 Tables'!F$10*(LOG(M13/N13*0.746))^3+'AMCA 208 Tables'!F$11*(LOG(M13/N13*0.746))^2+'AMCA 208 Tables'!F$12*LOG(M13/N13*0.746)+'AMCA 208 Tables'!F$13","v":0.94877850976503697},{"$f":"M13*(1/N13)*(1/O13)*0.746","v":51.764818161080541},18,{"$f":"IF(Q13>0,P13/Q13,\"-\")","v":2.8758232311711414}]
[null,null,null,"Circulating",{"$f":"VLOOKUP(D14,'AMCA 208 Tables'!$A$17:$G$27,5,FALSE)","v":"E"},{"$f":"VLOOKUP(D14,'AMCA 208 Tables'!$A$17:$G$27,6,FALSE)","v":"Total"},30,8.3550000000000004,7.4999999999999997E-2,20000,0.125,{"$f":"IF(F14=\"Total\",K14+(J14/(1097.8*H14))^2*I14,\"-\")","v":0.4816004553261542},{"$f":"IF(D14=\"Circulating\",($J14+'AMCA 208 Tables'!$I$3)*($L14+'AMCA 208 Tables'!$I$4*(IF($I14=0,0.075,$I14)/0.075))/(6343*'AMCA 208 Tables'!$I$5),(IF(F14=\"Total\",($J14+'AMCA 208 Tables'!$F$3)*($L14+'AMCA 208 Tables'!$F$4*(IF($I14=0,0.075,$I14)/0.075))/(6343*'AMCA 208 Tables'!$F$5),($J14+'AMCA 208 Tables'!$F$3)*($K14+'AMCA 208 Tables'!$F$4*(IF($I14=0,0.075,$I14)/0.075))/(6343*'AMCA 208 Tables'!$F$6))))","v":6.8688382436313846},{"$f":"0.96*(M14/(M14+2.2))^0.05","v":0.94675545195522781},{"$f":"'AMCA 208 Tables'!F$9*(LOG(M14/N14*0.746))^4+'AMCA 208 Tables'!F$10*(LOG(M14/N14*0.746))^3+'AMCA 208 Tables'!F$11*(LOG(M14/N14*0.746))^2+'AMCA 208 Tables'!F$12*LOG(M14/N14*0.746)+'AMCA 208 Tables'!F$13","v":0.91244256722545658},{"$f":"M14*(1/N14)*(1/O14)*0.746","v":5.9316943455525113},2.25,{"$f":"IF(Q14>0,P14/Q14,\"-\")","v":2.6363085980233385}]
[null,null,null,"Circulating",{"$f":"VLOOKUP(D15,'AMCA 208 Tables'!$A$17:$G$27,5,FALSE)","v":"E"},{"$f":"VLOOKUP(D15,'AMCA 208 Tables'!$A$17:$G$27,6,FALSE)","v":"Total"},36,7.07,7.4999999999999997E-2,20000,0.25,0.74800760428667268,{"$f":"IF(D15=\"Circulating\",($J15+'AMCA 208 Tables'!$I$3)*($L15+'AMCA 208 Tables'!$I$4*(IF($I15=0,0.075,$I15)/0.075))/(6343*'AMCA 208 Tables'!$I$5),(IF(F15=\"Total\",($J15+'AMCA 208 Tables'!$F$3)*($L15+'AMCA 208 Tables'!$F$4*(IF($I15=0,0.075,$I15)/0.075))/(6343*'AMCA 208 Tables'!$F$5),($J15+'AMCA 208 Tables'!$F$3)*($K15+'AMCA 208 Tables'!$F$4*(IF($I15=0,0.075,$I15)/0.075))/(6343*'AMCA 208 Tables'!$F$6))))","v":10.648854546082378},{"$f":"0.96*(M15/(M15+2.2))^0.05","v":0.95102767941743638},{"$f":"'AMCA 208 Tables'!F$9*(LOG(M15/N15*0.746))^4+'AMCA 208 Tables'!F$10*(LOG(M15/N15*0.746))^3+'AMCA 208 Tables'!F$11*(LOG(M15/N15*0.746))^2+'AMCA 208 Tables'!F$12*LOG(M15/N15*0.746)+'AMCA 208 Tables'!F$13","v":0.92185560988215975},{"$f":"M15*(1/N15)*(1/O15)*0.746","v":9.0611988756064576},null,"-"]
[null,null,null,"Circulating",{"$f":"VLOOKUP(D16,'AMCA 208 Tables'!$A$17:$G$27,5,FALSE)","v":"E"},{"$f":"VLOOKUP(D16,'AMCA 208 Tables'!$A$17:$G$27,6,FALSE)","v":"Total"},42.25,8.98,7.4999999999999997E-2,25525,0,0.50279811250549422,{"$f":"IF(D16=\"Circulating\",($J16+'AMCA 208 Tables'!$I$3)*($L16+'AMCA 208 Tables'!$I$4*(IF($I16=0,0.075,$I16)/0.075))/(6343*'AMCA 208 Tables'!$I$5),(IF(F16=\"Total\",($J16+'AMCA 208 Tables'!$F$3)*($L16+'AMCA 208 Tables'!$F$4*(IF($I16=0,0.075,$I16)/0.075))/(6343*'AMCA 208 Tables'!$F$5),($J16+'AMCA 208 Tables'!$F$3)*($K16+'AMCA 208 Tables'!$F$4*(IF($I16=0,0.075,$I16)/0.075))/(6343*'AMCA 208 Tables'!$F$6))))","v":8.2699448690645756},0.94874422205508624,{"$f":"'AMCA 208 Tables'!F$9*(LOG(M16/N16*0.746))^4+'AMCA 208 Tables'!F$10*(LOG(M16/N16*0.746))^3+'AMCA 208 Tables'!F$11*(LOG(M16/N16*0.746))^2+'AMCA 208 Tables'!F$12*LOG(M16/N16*0.746)+'AMCA 208 Tables'!F$13","v":0.91663506052679633},7.0940759407371381,null,"-"]
[null,null,null,"Circulating",{"$f":"VLOOKUP(D17,'AMCA 208 Tables'!$A$17:$G$27,5,FALSE)","v":"E"},{"$f":"VLOOKUP(D17,'AMCA 208 Tables'!$A$17:$G$27,6,FALSE)","v":"Total"},27,5.55,7.4999999999999997E-2,16000,7.62,8.1372122584753086,{"$f":"IF(D17=\"Circulating\",($J17+'AMCA 208 Tables'!$I$3)*($L17+'AMCA 208 Tables'!$I$4*(IF($I17=0,0.075,$I17)/0.075))/(6343*'AMCA 208 Tables'!$I$5),(IF(F17=\"Total\",($J17+'AMCA 208 Tables'!$F$3)*($L17+'AMCA 208 Tables'!$F$4*(IF($I17=0,0.075,$I17)/0.075))/(6343*'AMCA 208 Tables'!$F$5),($J17+'AMCA 208 Tables'!$F$3)*($K17+'AMCA 208 Tables'!$F$4*(IF($I17=0,0.075,$I17)/0.075))/(6343*'AMCA 208 Tables'!$F$6))))","v":102.66072531578504},0.95898277506595564,{"$f":"'AMCA 208 Tables'!F$9*(LOG(M17/N17*0.746))^4+'AMCA 208 Tables'!F$10*(LOG(M17/N17*0.746))^3+'AMCA 208 Tables'!F$11*(LOG(M17/N17*0.746))^2+'AMCA 208 Tables'!F$12*LOG(M17/N17*0.746)+'AMCA 208 Tables'!F$13","v":0.9543521995860702},83.680385142537858,null,"-"]
[null,null,null,"Circulating",{"$f":"VLOOKUP(D18,'AMCA 208 Tables'!$A$17:$G$27,5,FALSE)","v":"E"},{"$f":"VLOOKUP(D18,'AMCA 208 Tables'!$A$17:$G$27,6,FALSE)","v":"Total"},240,314.15926535897933,7.4999999999999997E-2,150000,null,{"$f":"IF(F18=\"Total\",K18+(J18/(1097.8*H18))^2*I18,\"-\")","v":1.4187229142566503E-2},{"$f":"IF(D18=\"Circulating\",($J18+'AMCA 208 Tables'!$I$3)*($L18+'AMCA 208 Tables'!$I$4*(IF($I18=0,0.075,$I18)/0.075))/(6343*'AMCA 208 Tables'!$I$5),(IF(F18=\"Total\",($J18+'AMCA 208 Tables'!$F$3)*($L18+'AMCA 208 Tables'!$F$4*(IF($I18=0,0.075,$I18)/0.075))/(6343*'AMCA 208 Tables'!$F$5),($J18+'AMCA 208 Tables'!$F$3)*($K18+'AMCA 208 Tables'!$F$4*(IF($I18=0,0.075,$I18)/0.075))/(6343*'AMCA 208 Tables'!$F$6))))","v":1.0917862358765722},{"$f":"0.96*(M18/(M18+2.2))^0.05","v":0.90846151174486989},{"$f":"'AMCA 208 Tables'!F$9*(LOG(M18/N18*0.746))^4+'AMCA 208 Tables'!F$10*(LOG(M18/N18*0.746))^3+'AMCA 208 Tables'!F$11*(LOG(M18/N18*0.746))^2+'AMCA 208 Tables'!F$12*LOG(M18/N18*0.746)+'AMCA 208 Tables'!F$13","v":0.84417668665961698},{"$f":"M18*(1/N18)*(1/O18)*0.746","v":1.0620294395190786},0.75,{"$f":"IF(Q18>0,P18/Q18,\"-\")","v":1.4160392526921048}]
[null,null,null,"Circulating",{"$f":"VLOOKUP(D19,'AMCA 208 Tables'!$A$17:$G$27,5,FALSE)","v":"E"},{"$f":"VLOOKUP(D19,'AMCA 208 Tables'!$A$17:$G$27,6,FALSE)","v":"Total"},96,50.26548245743669,7.4999999999999997E-2,29000,null,2.071433977239311E-2,{"$f":"IF(D19=\"Circulating\",($J19+'AMCA 208 Tables'!$I$3)*($L19+'AMCA 208 Tables'!$I$4*(IF($I19=0,0.075,$I19)/0.075))/(6343*'AMCA 208 Tables'!$I$5),(IF(F19=\"Total\",($J19+'AMCA 208 Tables'!$F$3)*($L19+'AMCA 208 Tables'!$F$4*(IF($I19=0,0.075,$I19)/0.075))/(6343*'AMCA 208 Tables'!$F$5),($J19+'AMCA 208 Tables'!$F$3)*($K19+'AMCA 208 Tables'!$F$4*(IF($I19=0,0.075,$I19)/0.075))/(6343*'AMCA 208 Tables'!$F$6))))","v":0.41173155043263826},0.87529714850490392,{"$f":"'AMCA 208 Tables'!F$9*(LOG(M19/N19*0.746))^4+'AMCA 208 Tables'!F$10*(LOG(M19/N19*0.746))^3+'AMCA 208 Tables'!F$11*(LOG(M19/N19*0.746))^2+'AMCA 208 Tables'!F$12*LOG(M19/N19*0.746)+'AMCA 208 Tables'!F$13","v":0.77557014205307473},0.45245602970718934,0.57999999999999996,0.78009660294342997]
[null,null,null,"Circulating",{"$f":"VLOOKUP(D20,'AMCA 208 Tables'!$A$17:$G$27,5,FALSE)","v":"E"},{"$f":"VLOOKUP(D20,'AMCA 208 Tables'!$A$17:$G$27,6,FALSE)","v":"Total"},72,28.274333882308138,7.4999999999999997E-2,10500,null,8.5823978763673921E-3,{"$f":"IF(D20=\"Circulating\",($J20+'AMCA 208 Tables'!$I$3)*($L20+'AMCA 208 Tables'!$I$4*(IF($I20=0,0.075,$I20)/0.075))/(6343*'AMCA 208 Tables'!$I$5),(IF(F20=\"Total\",($J20+'AMCA 208 Tables'!$F$3)*($L20+'AMCA 208 Tables'!$F$4*(IF($I20=0,0.075,$I20)/0.075))/(6343*'AMCA 208 Tables'!$F$5),($J20+'AMCA 208 Tables'!$F$3)*($K20+'AMCA 208 Tables'!$F$4*(IF($I20=0,0.075,$I20)/0.075))/(6343*'AMCA 208 Tables'!$F$6))))","v":0.1157510419847611},0.82644296110717308,{"$f":"'AMCA 208 Tables'!F$9*(LOG(M20/N20*0.746))^4+'AMCA 208 Tables'!F$10*(LOG(M20/N20*0.746))^3+'AMCA 208 Tables'!F$11*(LOG(M20/N20*0.746))^2+'AMCA 208 Tables'!F$12*LOG(M20/N20*0.746)+'AMCA 208 Tables'!F$13","v":0.62936064728916596},0.16601650536550649,0.111,1.4956441924820405]

{"sheet":"Fan with Regulated Motor","index":1,"n_rows":16,"n_cols":27,"rows_kept":16,"cut":false,"hidden":false,"merged":[[8,16,8,26],[9,3,10,5],[9,6,10,11],[9,12,9,15],[9,18,9,26],[10,12,10,15],[10,18,10,26]]}
["FEI Calculations "]
[]
["Instructions:"]
["Please fill the blue colored cells."]
[]
["Only ODP and TEFC motors are considered."]
["Please copy down from row 17."]
["Assumption: VFD capacity is same as motor capacity when VFD capacity is not given."]
[null,null,null,null,null,null,null,null,null,null,null,null,null,null,null,null,"Hi Measured"]
[null,null,null,"AMCA 208 Annex A",null,null,"Duty Point",null,null,null,null,null,"FEPref Calculation",null,null,null,null,null,"Fan paired with regulated motor (US Regulation only)"]
[null,null,null,null,null,null,null,null,null,null,null,null,"Section 5.2",null,null,null,null,null,"Section 5.3.3  (uses AMCA 207)"]
["Qty\nSold","Model","Size","Fan Category","Test\nConfig","FEI Pressure Basis","Impeller Dia\n(in.)","Outlet Area \n(ft²)","Air Density\n(lb/ft³)","Airflow\n(cfm)","Fan\nStatic\nPressure\n(in. wg)","Fan\nTotal\nPressure\n(in. wg)","Hi,ref\n(bhp)","ηtrans,ref","ηmtr,ref","FEPref\n(kW)","Hi,act\n(bhp)","Drive Type","Motor Size\n(hp)","Motor Encl.","No.\nPoles","Include VFD?","VFD Capacity (hp)","ηtrans,act","ηmtr,act","FEPact\n(kW)","FEI"]
[null,"ABC",300,"Centrifugal PRV Exhaust",{"$f":"VLOOKUP(D13,'AMCA 208 Tables'!$A$17:$G$27,5,FALSE)","v":"A or C"},{"$f":"VLOOKUP(D13,'AMCA 208 Tables'!$A$17:$G$27,6,FALSE)","v":"Static"},31.5,7.88,7.4999999999999997E-2,5000,2,{"$f":"IF(F13=\"Total\",K13+(J13/(1097.8*H13))^2*I13,\"-\")","v":"-"},{"$f":"IF(D13=\"Circulating\",($J13+'AMCA 208 Tables'!$I$3)*($L13+'AMCA 208 Tables'!$I$4*(IF($I13=0,0.075,$I13)/0.075))/(6343*'AMCA 208 Tables'!$I$5),(IF(F13=\"Total\",($J13+'AMCA 208 Tables'!$F$3)*($L13+'AMCA 208 Tables'!$F$4*(IF($I13=0,0.075,$I13)/0.075))/(6343*'AMCA 208 Tables'!$F$5),($J13+'AMCA 208 Tables'!$F$3)*($K13+'AMCA 208 Tables'!$F$4*(IF($I13=0,0.075,$I13)/0.075))/(6343*'AMCA 208 Tables'!$F$6))))","v":3.3107362446791742},{"$f":"0.96*(M13/(M13+2.2))^0.05","v":0.9358515865407705},{"$f":"'AMCA 208 Tables'!F$9*(LOG(M13/N13*0.746))^4+'AMCA 208 Tables'!F$10*(LOG(M13/N13*0.746))^3+'AMCA 208 Tables'!F$11*(LOG(M13/N13*0.746))^2+'AMCA 208 Tables'!F$12*LOG(M13/N13*0.746)+'AMCA 208 Tables'!F$13","v":0.89215084613118467},{"$f":"M13*(1/N13)*(1/O13)*0.746","v":2.9581360094718523},4.04,"V-Belt",3,"ODP",4,"No",10,{"$f":"IF($R13=\"Direct\",1,IF($R13=\"Coupling\",0.98,IF($R13=\"V-Belt\",0.96*(Q13/(Q13+2.2))^0.05,IF($R13=\"Synch Belt\",IF(Q13<=1.34,0.94,IF(Q13<=6.7,(0.00746*Q13+0.93),0.98)),\"Missing Transmission Type\"))))","v":0.93935785603122302},{"$f":"IF(Q13/X13>1.5*S13, \"Overload\", IF(AND(V13=\"Yes\",ISNUMBER(W13)),EtaMtrAct(Q13/X13,S13,W13,T13,U13,V13),EtaMtrAct(Q13/X13,S13,S13,T13,U13,V13)))","v":0.87656804504289032},{"$f":"IF(Q13/X13>1.5*S13, \"Overload\",Q13*(1/X13)*(1/Y13)*0.746)","v":3.6601887868543042},{"$f":"IF(Q13/X13>1.5*S13, \"Overload\",P13/Z13)","v":0.80819219492068306}]
[null,"ABC",540,"Centrifugal Unhoused",{"$f":"VLOOKUP(D14,'AMCA 208 Tables'!$A$17:$G$27,5,FALSE)","v":"A"},{"$f":"VLOOKUP(D14,'AMCA 208 Tables'!$A$17:$G$27,6,FALSE)","v":"Static"},54,null,7.4999999999999997E-2,40131,0.125,{"$f":"IF(F14=\"Total\",K14+(J14/(1097.8*H14))^2*I14,\"-\")","v":"-"},{"$f":"IF(D14=\"Circulating\",($J14+'AMCA 208 Tables'!$I$3)*($L14+'AMCA 208 Tables'!$I$4*(IF($I14=0,0.075,$I14)/0.075))/(6343*'AMCA 208 Tables'!$I$5),(IF(F14=\"Total\",($J14+'AMCA 208 Tables'!$F$3)*($L14+'AMCA 208 Tables'!$F$4*(IF($I14=0,0.075,$I14)/0.075))/(6343*'AMCA 208 Tables'!$F$5),($J14+'AMCA 208 Tables'!$F$3)*($K14+'AMCA 208 Tables'!$F$4*(IF($I14=0,0.075,$I14)/0.075))/(6343*'AMCA 208 Tables'!$F$6))))","v":5.5704516790162391},{"$f":"0.96*(M14/(M14+2.2))^0.05","v":0.94415531090047311},{"$f":"'AMCA 208 Tables'!F$9*(LOG(M14/N14*0.746))^4+'AMCA 208 Tables'!F$10*(LOG(M14/N14*0.746))^3+'AMCA 208 Tables'!F$11*(LOG(M14/N14*0.746))^2+'AMCA 208 Tables'!F$12*LOG(M14/N14*0.746)+'AMCA 208 Tables'!F$13","v":0.90728895307871316},{"$f":"M14*(1/N14)*(1/O14)*0.746","v":4.8510994202537487},2.762,"V-Belt",3,"ODP",4,"No",7.5,{"$f":"IF($R14=\"Direct\",1,IF($R14=\"Coupling\",0.98,IF($R14=\"V-Belt\",0.96*(Q14/(Q14+2.2))^0.05,IF($R14=\"Synch Belt\",IF(Q14<=1.34,0.94,IF(Q14<=6.7,(0.00746*Q14+0.93),0.98)),\"Missing Transmission Type\"))))","v":0.93228689348786287},{"$f":"IF(Q14/X14>1.5*S14, \"Overload\", IF(AND(V14=\"Yes\",ISNUMBER(W14)),EtaMtrAct(Q14/X14,S14,W14,T14,U14,V14),EtaMtrAct(Q14/X14,S14,S14,T14,U14,V14)))","v":0.89512472536877608},{"$f":"IF(Q14/X14>1.5*S14, \"Overload\",Q14*(1/X14)*(1/Y14)*0.746)","v":2.4690470703111083},{"$f":"IF(Q14/X14>1.5*S14, \"Overload\",P14/Z14)","v":1.964765872058686}]
[null,"ABC",600,"Centrifugal Unhoused",{"$f":"VLOOKUP(D15,'AMCA 208 Tables'!$A$17:$G$27,5,FALSE)","v":"A"},{"$f":"VLOOKUP(D15,'AMCA 208 Tables'!$A$17:$G$27,6,FALSE)","v":"Static"},60,null,7.4999999999999997E-2,39858,0.125,"-",{"$f":"IF(D15=\"Circulating\",($J15+'AMCA 208 Tables'!$I$3)*($L15+'AMCA 208 Tables'!$I$4*(IF($I15=0,0.075,$I15)/0.075))/(6343*'AMCA 208 Tables'!$I$5),(IF(F15=\"Total\",($J15+'AMCA 208 Tables'!$F$3)*($L15+'AMCA 208 Tables'!$F$4*(IF($I15=0,0.075,$I15)/0.075))/(6343*'AMCA 208 Tables'!$F$5),($J15+'AMCA 208 Tables'!$F$3)*($K15+'AMCA 208 Tables'!$F$4*(IF($I15=0,0.075,$I15)/0.075))/(6343*'AMCA 208 Tables'!$F$6))))","v":5.5327920542330133},{"$f":"0.96*(M15/(M15+2.2))^0.05","v":0.94406442793977363},{"$f":"'AMCA 208 Tables'!F$9*(LOG(M15/N15*0.746))^4+'AMCA 208 Tables'!F$10*(LOG(M15/N15*0.746))^3+'AMCA 208 Tables'!F$11*(LOG(M15/N15*0.746))^2+'AMCA 208 Tables'!F$12*LOG(M15/N15*0.746)+'AMCA 208 Tables'!F$13","v":0.90711396454526161},{"$f":"M15*(1/N15)*(1/O15)*0.746","v":4.8196964726572036},4.04,"V-Belt",5,"TEFC",4,"No",5,0.93935785603122302,{"$f":"IF(Q15/X15>1.5*S15, \"Overload\", IF(AND(V15=\"Yes\",ISNUMBER(W15)),EtaMtrAct(Q15/X15,S15,W15,T15,U15,V15),EtaMtrAct(Q15/X15,S15,S15,T15,U15,V15)))","v":0.89977200569412685},{"$f":"IF(Q15/X15>1.5*S15, \"Overload\",Q15*(1/X15)*(1/Y15)*0.746)","v":3.5657972342734432},{"$f":"IF(Q15/X15>1.5*S15, \"Overload\",P15/Z15)","v":1.3516462535591292}]
[null,"ABC",720,"Centrifugal Unhoused",{"$f":"VLOOKUP(D16,'AMCA 208 Tables'!$A$17:$G$27,5,FALSE)","v":"A"},{"$f":"VLOOKUP(D16,'AMCA 208 Tables'!$A$17:$G$27,6,FALSE)","v":"Static"},72,null,7.4999999999999997E-2,39308,0.125,"-",{"$f":"IF(D16=\"Circulating\",($J16+'AMCA 208 Tables'!$I$3)*($L16+'AMCA 208 Tables'!$I$4*(IF($I16=0,0.075,$I16)/0.075))/(6343*'AMCA 208 Tables'!$I$5),(IF(F16=\"Total\",($J16+'AMCA 208 Tables'!$F$3)*($L16+'AMCA 208 Tables'!$F$4*(IF($I16=0,0.075,$I16)/0.075))/(6343*'AMCA 208 Tables'!$F$5),($J16+'AMCA 208 Tables'!$F$3)*($K16+'AMCA 208 Tables'!$F$4*(IF($I16=0,0.075,$I16)/0.075))/(6343*'AMCA 208 Tables'!$F$6))))","v":5.4569210152924486},0.94387809658194977,{"$f":"'AMCA 208 Tables'!F$9*(LOG(M16/N16*0.746))^4+'AMCA 208 Tables'!F$10*(LOG(M16/N16*0.746))^3+'AMCA 208 Tables'!F$11*(LOG(M16/N16*0.746))^2+'AMCA 208 Tables'!F$12*LOG(M16/N16*0.746)+'AMCA 208 Tables'!F$13","v":0.90675612597584376},4.756418819909574,2.762,"V-Belt",3,"TEFC",4,"No",3,0.93228689348786287,{"$f":"IF(Q16/X16>1.5*S16, \"Overload\", IF(AND(V16=\"Yes\",ISNUMBER(W16)),EtaMtrAct(Q16/X16,S16,W16,T16,U16,V16),EtaMtrAct(Q16/X16,S16,S16,T16,U16,V16)))","v":0.89512472536877608},2.4690470703111083,{"$f":"IF(Q16/X16>1.5*S16, \"Overload\",P16/Z16)","v":1.9264188508606477}]

{"sheet":"Fan without motor","index":2,"n_rows":28,"n_cols":22,"rows_kept":28,"cut":false,"hidden":false,"merged":[[10,22,10,23],[8,16,8,21],[9,3,10,5],[9,6,10,11],[9,18,9,21],[10,18,10,21],[9,12,9,15],[10,12,10,15]]}
["FEI Calculations "]
[]
["Instructions:"]
["Please fill the blue colored cells."]
[]
["Only ODP and TEFC motors are considered."]
["Please copy down from row 17."]
[]
[null,null,null,null,null,null,null,null,null,null,null,null,null,null,null,null,"Hi Measured"]
[null,null,null,"AMCA 208 Annex A",null,null,"Duty Point",null,null,null,null,null,"FEPref Calculation",null,null,null,null,null,"Fan with unregulated or w/o motor"]
[null,null,null,null,null,null,null,null,null,null,null,null,"Section 5.2",null,null,null,null,null,"Section 5.3.4  (default motor efficiency)"]
["Qty\nSold","Model","Size","Fan Category","Test\nConfig","FEI Pressure Basis","Impeller Dia\n(in.)","Outlet Area \n(ft²)","Air Density\n(lb/ft³)","Airflow\n(cfm)","Fan\nStatic\nPressure\n(in. wg)","Fan\nTotal\nPressure\n(in. wg)","Hi,ref\n(bhp)","ηtrans,ref","ηmtr,ref","FEPref\n(kW)","Hi,act\n(bhp)","Drive Type","ηtrans,def","ηmtr,def","FEPact\n(kW)","FEI"]
[null,"ABC",300,"Centrifugal PRV Exhaust",{"$f":"VLOOKUP(D13,'AMCA 208 Tables'!$A$17:$G$27,5,FALSE)","v":"A or C"},{"$f":"VLOOKUP(D13,'AMCA 208 Tables'!$A$17:$G$27,6,FALSE)","v":"Static"},31.5,7.88,7.4999999999999997E-2,5000,2,{"$f":"IF(F13=\"Total\",K13+(J13/(1097.8*H13))^2*I13,\"-\")","v":"-"},{"$f":"IF(D13=\"Circulating\",($J13+'AMCA 208 Tables'!$I$3)*($L13+'AMCA 208 Tables'!$I$4*(IF($I13=0,0.075,$I13)/0.075))/(6343*'AMCA 208 Tables'!$I$5),(IF(F13=\"Total\",($J13+'AMCA 208 Tables'!$F$3)*($L13+'AMCA 208 Tables'!$F$4*(IF($I13=0,0.075,$I13)/0.075))/(6343*'AMCA 208 Tables'!$F$5),($J13+'AMCA 208 Tables'!$F$3)*($K13+'AMCA 208 Tables'!$F$4*(IF($I13=0,0.075,$I13)/0.075))/(6343*'AMCA 208 Tables'!$F$6))))","v":3.3107362446791742},{"$f":"0.96*(M13/(M13+2.2))^0.05","v":0.9358515865407705},{"$f":"'AMCA 208 Tables'!F$9*(LOG(M13/N13*0.746))^4+'AMCA 208 Tables'!F$10*(LOG(M13/N13*0.746))^3+'AMCA 208 Tables'!F$11*(LOG(M13/N13*0.746))^2+'AMCA 208 Tables'!F$12*LOG(M13/N13*0.746)+'AMCA 208 Tables'!F$13","v":0.89215084613118467},{"$f":"M13*(1/N13)*(1/O13)*0.746","v":2.9581360094718523},2.4700000000000002,"V-Belt",{"$f":"IF($R13=\"Direct\",1,IF($R13=\"Coupling\",0.98,IF($R13=\"V-Belt\",0.96*(Q13/(Q13+2.2))^0.05,IF($R13=\"Synch Belt\",IF(Q13<=1.34,0.94,IF(Q13<=6.7,(0.00746*Q13+0.93),0.98)),\"Missing Transmission Type\"))))","v":0.92990854110161847},{"$f":"'AMCA 208 Tables'!F$9*(LOG(Q13/S13*0.746))^4+'AMCA 208 Tables'!F$10*(LOG(Q13/S13*0.746))^3+'AMCA 208 Tables'!F$11*(LOG(Q13/S13*0.746))^2+'AMCA 208 Tables'!F$12*LOG(Q13/S13*0.746)+'AMCA 208 Tables'!F$13","v":0.88184517358271464},{"$f":"Q13*(1/S13)*(1/T13)*0.746","v":2.2470006690906228},{"$f":"P13/U13","v":1.3164820332114235}]
[null,"ABC",210,"Centrifugal PRV Exhaust",{"$f":"VLOOKUP(D14,'AMCA 208 Tables'!$A$17:$G$27,5,FALSE)","v":"A or C"},{"$f":"VLOOKUP(D14,'AMCA 208 Tables'!$A$17:$G$27,6,FALSE)","v":"Static"},38.380000000000003,null,7.4999999999999997E-2,5000,2,{"$f":"IF(F14=\"Total\",K14+(J14/(1097.8*H14))^2*I14,\"-\")","v":"-"},{"$f":"IF(D14=\"Circulating\",($J14+'AMCA 208 Tables'!$I$3)*($L14+'AMCA 208 Tables'!$I$4*(IF($I14=0,0.075,$I14)/0.075))/(6343*'AMCA 208 Tables'!$I$5),(IF(F14=\"Total\",($J14+'AMCA 208 Tables'!$F$3)*($L14+'AMCA 208 Tables'!$F$4*(IF($I14=0,0.075,$I14)/0.075))/(6343*'AMCA 208 Tables'!$F$5),($J14+'AMCA 208 Tables'!$F$3)*($K14+'AMCA 208 Tables'!$F$4*(IF($I14=0,0.075,$I14)/0.075))/(6343*'AMCA 208 Tables'!$F$6))))","v":3.3107362446791742},{"$f":"0.96*(M14/(M14+2.2))^0.05","v":0.9358515865407705},{"$f":"'AMCA 208 Tables'!F$9*(LOG(M14/N14*0.746))^4+'AMCA 208 Tables'!F$10*(LOG(M14/N14*0.746))^3+'AMCA 208 Tables'!F$11*(LOG(M14/N14*0.746))^2+'AMCA 208 Tables'!F$12*LOG(M14/N14*0.746)+'AMCA 208 Tables'!F$13","v":0.89215084613118467},{"$f":"M14*(1/N14)*(1/O14)*0.746","v":2.9581360094718523},2.9,"V-Belt",{"$f":"IF($R14=\"Direct\",1,IF($R14=\"Coupling\",0.98,IF($R14=\"V-Belt\",0.96*(Q14/(Q14+2.2))^0.05,IF($R14=\"Synch Belt\",IF(Q14<=1.34,0.94,IF(Q14<=6.7,(0.00746*Q14+0.93),0.98)),\"Missing Transmission Type\"))))","v":0.93328142915110823},{"$f":"'AMCA 208 Tables'!F$9*(LOG(Q14/S14*0.746))^4+'AMCA 208 Tables'!F$10*(LOG(Q14/S14*0.746))^3+'AMCA 208 Tables'!F$11*(LOG(Q14/S14*0.746))^2+'AMCA 208 Tables'!F$12*LOG(Q14/S14*0.746)+'AMCA 208 Tables'!F$13","v":0.88766920444449404},2.6113978842151044,{"$f":"P14/U14","v":1.1327787417431279}]
[null,"ABC",903,"Axial Inline",{"$f":"VLOOKUP(D15,'AMCA 208 Tables'!$A$17:$G$27,5,FALSE)","v":"B or D"},{"$f":"VLOOKUP(D15,'AMCA 208 Tables'!$A$17:$G$27,6,FALSE)","v":"Total"},13.65,1.036,7.4999999999999997E-2,8000,1,4.710866012657668,{"$f":"IF(D15=\"Circulating\",($J15+'AMCA 208 Tables'!$I$3)*($L15+'AMCA 208 Tables'!$I$4*(IF($I15=0,0.075,$I15)/0.075))/(6343*'AMCA 208 Tables'!$I$5),(IF(F15=\"Total\",($J15+'AMCA 208 Tables'!$F$3)*($L15+'AMCA 208 Tables'!$F$4*(IF($I15=0,0.075,$I15)/0.075))/(6343*'AMCA 208 Tables'!$F$5),($J15+'AMCA 208 Tables'!$F$3)*($K15+'AMCA 208 Tables'!$F$4*(IF($I15=0,0.075,$I15)/0.075))/(6343*'AMCA 208 Tables'!$F$6))))","v":10.071862708217067},0.95056364091516432,{"$f":"'AMCA 208 Tables'!F$9*(LOG(M15/N15*0.746))^4+'AMCA 208 Tables'!F$10*(LOG(M15/N15*0.746))^3+'AMCA 208 Tables'!F$11*(LOG(M15/N15*0.746))^2+'AMCA 208 Tables'!F$12*LOG(M15/N15*0.746)+'AMCA 208 Tables'!F$13","v":0.9207496870359807},8.5847142971758199,2.61,"Direct",1,{"$f":"'AMCA 208 Tables'!F$9*(LOG(Q15/S15*0.746))^4+'AMCA 208 Tables'!F$10*(LOG(Q15/S15*0.746))^3+'AMCA 208 Tables'!F$11*(LOG(Q15/S15*0.746))^2+'AMCA 208 Tables'!F$12*LOG(Q15/S15*0.746)+'AMCA 208 Tables'!F$13","v":0.8811650488474585},2.2096427934207159,{"$f":"P15/U15","v":3.8851140658286893}]
[null,"ABC",160,"Centrifugal PRV Exhaust",{"$f":"VLOOKUP(D16,'AMCA 208 Tables'!$A$17:$G$27,5,FALSE)","v":"A or C"},{"$f":"VLOOKUP(D16,'AMCA 208 Tables'!$A$17:$G$27,6,FALSE)","v":"Static"},16.75,2.87,7.4999999999999997E-2,2000,0.125,"-",{"$f":"IF(D16=\"Circulating\",($J16+'AMCA 208 Tables'!$I$3)*($L16+'AMCA 208 Tables'!$I$4*(IF($I16=0,0.075,$I16)/0.075))/(6343*'AMCA 208 Tables'!$I$5),(IF(F16=\"Total\",($J16+'AMCA 208 Tables'!$F$3)*($L16+'AMCA 208 Tables'!$F$4*(IF($I16=0,0.075,$I16)/0.075))/(6343*'AMCA 208 Tables'!$F$5),($J16+'AMCA 208 Tables'!$F$3)*($K16+'AMCA 208 Tables'!$F$4*(IF($I16=0,0.075,$I16)/0.075))/(6343*'AMCA 208 Tables'!$F$6))))","v":0.31038152293867255},0.86472703994139344,{"$f":"'AMCA 208 Tables'!F$9*(LOG(M16/N16*0.746))^4+'AMCA 208 Tables'!F$10*(LOG(M16/N16*0.746))^3+'AMCA 208 Tables'!F$11*(LOG(M16/N16*0.746))^2+'AMCA 208 Tables'!F$12*LOG(M16/N16*0.746)+'AMCA 208 Tables'!F$13","v":0.74941012769303139},0.35730252863444911,0.19,"Direct",1,{"$f":"'AMCA 208 Tables'!F$9*(LOG(Q16/S16*0.746))^4+'AMCA 208 Tables'!F$10*(LOG(Q16/S16*0.746))^3+'AMCA 208 Tables'!F$11*(LOG(Q16/S16*0.746))^2+'AMCA 208 Tables'!F$12*LOG(Q16/S16*0.746)+'AMCA 208 Tables'!F$13","v":0.67372714118007171},0.21038190587325054,{"$f":"P16/U16","v":1.6983519906398905}]
[null,"ABC",300,"Centrifugal Housed",{"$f":"VLOOKUP(D17,'AMCA 208 Tables'!$A$17:$G$27,5,FALSE)","v":"B or D"},{"$f":"VLOOKUP(D17,'AMCA 208 Tables'!$A$17:$G$27,6,FALSE)","v":"Total"},31.5,9.23,7.4999999999999997E-2,5000,2,2.0182621294581979,{"$f":"IF(D17=\"Circulating\",($J17+'AMCA 208 Tables'!$I$3)*($L17+'AMCA 208 Tables'!$I$4*(IF($I17=0,0.075,$I17)/0.075))/(6343*'AMCA 208 Tables'!$I$5),(IF(F17=\"Total\",($J17+'AMCA 208 Tables'!$F$3)*($L17+'AMCA 208 Tables'!$F$4*(IF($I17=0,0.075,$I17)/0.075))/(6343*'AMCA 208 Tables'!$F$5),($J17+'AMCA 208 Tables'!$F$3)*($K17+'AMCA 208 Tables'!$F$4*(IF($I17=0,0.075,$I17)/0.075))/(6343*'AMCA 208 Tables'!$F$6))))","v":3.0326621519440518},0.93417082517556504,{"$f":"'AMCA 208 Tables'!F$9*(LOG(M17/N17*0.746))^4+'AMCA 208 Tables'!F$10*(LOG(M17/N17*0.746))^3+'AMCA 208 Tables'!F$11*(LOG(M17/N17*0.746))^2+'AMCA 208 Tables'!F$12*LOG(M17/N17*0.746)+'AMCA 208 Tables'!F$13","v":0.88921432392367816},2.7235171160266063,2.42,"V-Belt",0.92945828409694597,{"$f":"'AMCA 208 Tables'!F$9*(LOG(Q17/S17*0.746))^4+'AMCA 208 Tables'!F$10*(LOG(Q17/S17*0.746))^3+'AMCA 208 Tables'!F$11*(LOG(Q17/S17*0.746))^2+'AMCA 208 Tables'!F$12*LOG(Q17/S17*0.746)+'AMCA 208 Tables'!F$13","v":0.88107035834621716},2.2045182592032044,{"$f":"P17/U17","v":1.2354250660690773}]
[null,"ABC",240,"Centrifugal Inline",{"$f":"VLOOKUP(D18,'AMCA 208 Tables'!$A$17:$G$27,5,FALSE)","v":"B or D"},{"$f":"VLOOKUP(D18,'AMCA 208 Tables'!$A$17:$G$27,6,FALSE)","v":"Total"},27.95,6.07,7.4999999999999997E-2,5000,2,2.0422257563114381,{"$f":"IF(D18=\"Circulating\",($J18+'AMCA 208 Tables'!$I$3)*($L18+'AMCA 208 Tables'!$I$4*(IF($I18=0,0.075,$I18)/0.075))/(6343*'AMCA 208 Tables'!$I$5),(IF(F18=\"Total\",($J18+'AMCA 208 Tables'!$F$3)*($L18+'AMCA 208 Tables'!$F$4*(IF($I18=0,0.075,$I18)/0.075))/(6343*'AMCA 208 Tables'!$F$5),($J18+'AMCA 208 Tables'!$F$3)*($K18+'AMCA 208 Tables'!$F$4*(IF($I18=0,0.075,$I18)/0.075))/(6343*'AMCA 208 Tables'!$F$6))))","v":3.0627141398141235},0.93436393540493168,{"$f":"'AMCA 208 Tables'!F$9*(LOG(M18/N18*0.746))^4+'AMCA 208 Tables'!F$10*(LOG(M18/N18*0.746))^3+'AMCA 208 Tables'!F$11*(LOG(M18/N18*0.746))^2+'AMCA 208 Tables'!F$12*LOG(M18/N18*0.746)+'AMCA 208 Tables'!F$13","v":0.8895505316727409},2.7488978415369436,2.72,"V-Belt",0.93196890645104058,{"$f":"'AMCA 208 Tables'!F$9*(LOG(Q18/S18*0.746))^4+'AMCA 208 Tables'!F$10*(LOG(Q18/S18*0.746))^3+'AMCA 208 Tables'!F$11*(LOG(Q18/S18*0.746))^2+'AMCA 208 Tables'!F$12*LOG(Q18/S18*0.746)+'AMCA 208 Tables'!F$13","v":0.88539739913820126},2.4590540039538724,{"$f":"P18/U18","v":1.1178680244992734}]
[null,"ABC",36,"Centrifugal PRV Exhaust",{"$f":"VLOOKUP(D19,'AMCA 208 Tables'!$A$17:$G$27,5,FALSE)","v":"A or C"},{"$f":"VLOOKUP(D19,'AMCA 208 Tables'!$A$17:$G$27,6,FALSE)","v":"Static"},35.94,7.2169999999999996,7.4999999999999997E-2,3500,1.5,"-",{"$f":"IF(D19=\"Circulating\",($J19+'AMCA 208 Tables'!$I$3)*($L19+'AMCA 208 Tables'!$I$4*(IF($I19=0,0.075,$I19)/0.075))/(6343*'AMCA 208 Tables'!$I$5),(IF(F19=\"Total\",($J19+'AMCA 208 Tables'!$F$3)*($L19+'AMCA 208 Tables'!$F$4*(IF($I19=0,0.075,$I19)/0.075))/(6343*'AMCA 208 Tables'!$F$5),($J19+'AMCA 208 Tables'!$F$3)*($K19+'AMCA 208 Tables'!$F$4*(IF($I19=0,0.075,$I19)/0.075))/(6343*'AMCA 208 Tables'!$F$6))))","v":1.8721425193126282},0.92341522314006785,{"$f":"'AMCA 208 Tables'!F$9*(LOG(M19/N19*0.746))^4+'AMCA 208 Tables'!F$10*(LOG(M19/N19*0.746))^3+'AMCA 208 Tables'!F$11*(LOG(M19/N19*0.746))^2+'AMCA 208 Tables'!F$12*LOG(M19/N19*0.746)+'AMCA 208 Tables'!F$13","v":0.87066969963020502},1.7371098132692524,2,"V-Belt",0.92503947957699628,{"$f":"'AMCA 208 Tables'!F$9*(LOG(Q19/S19*0.746))^4+'AMCA 208 Tables'!F$10*(LOG(Q19/S19*0.746))^3+'AMCA 208 Tables'!F$11*(LOG(Q19/S19*0.746))^2+'AMCA 208 Tables'!F$12*LOG(Q19/S19*0.746)+'AMCA 208 Tables'!F$13","v":0.87347028347371347},1.8465472308961608,0.94073402738049838]
[null,"ABC",222,"Centrifugal Housed",{"$f":"VLOOKUP(D20,'AMCA 208 Tables'!$A$17:$G$27,5,FALSE)","v":"B or D"},{"$f":"VLOOKUP(D20,'AMCA 208 Tables'!$A$17:$G$27,6,FALSE)","v":"Total"},22.25,3.9710000000000001,7.4999999999999997E-2,5500,1.2,1.3193824302084318,{"$f":"IF(D20=\"Circulating\",($J20+'AMCA 208 Tables'!$I$3)*($L20+'AMCA 208 Tables'!$I$4*(IF($I20=0,0.075,$I20)/0.075))/(6343*'AMCA 208 Tables'!$I$5),(IF(F20=\"Total\",($J20+'AMCA 208 Tables'!$F$3)*($L20+'AMCA 208 Tables'!$F$4*(IF($I20=0,0.075,$I20)/0.075))/(6343*'AMCA 208 Tables'!$F$5),($J20+'AMCA 208 Tables'!$F$3)*($K20+'AMCA 208 Tables'!$F$4*(IF($I20=0,0.075,$I20)/0.075))/(6343*'AMCA 208 Tables'!$F$6))))","v":2.3615746716013555},0.92891414841577447,{"$f":"'AMCA 208 Tables'!F$9*(LOG(M20/N20*0.746))^4+'AMCA 208 Tables'!F$10*(LOG(M20/N20*0.746))^3+'AMCA 208 Tables'!F$11*(LOG(M20/N20*0.746))^2+'AMCA 208 Tables'!F$12*LOG(M20/N20*0.746)+'AMCA 208 Tables'!F$13","v":0.88013440927755149},2.1548444806149512,1.72,"Direct",1,{"$f":"'AMCA 208 Tables'!F$9*(LOG(Q20/S20*0.746))^4+'AMCA 208 Tables'!F$10*(LOG(Q20/S20*0.746))^3+'AMCA 208 Tables'!F$11*(LOG(Q20/S20*0.746))^2+'AMCA 208 Tables'!F$12*LOG(Q20/S20*0.746)+'AMCA 208 Tables'!F$13","v":0.86307958712434463},1.4866763380132404,1.4494375308983765]
[null,"ABC",165,"Centrifugal Housed",{"$f":"VLOOKUP(D21,'AMCA 208 Tables'!$A$17:$G$27,5,FALSE)","v":"B or D"},{"$f":"VLOOKUP(D21,'AMCA 208 Tables'!$A$17:$G$27,6,FALSE)","v":"Total"},16.5,2.82,7.4999999999999997E-2,5500,1.2,1.4367238267881848,{"$f":"IF(D21=\"Circulating\",($J21+'AMCA 208 Tables'!$I$3)*($L21+'AMCA 208 Tables'!$I$4*(IF($I21=0,0.075,$I21)/0.075))/(6343*'AMCA 208 Tables'!$I$5),(IF(F21=\"Total\",($J21+'AMCA 208 Tables'!$F$3)*($L21+'AMCA 208 Tables'!$F$4*(IF($I21=0,0.075,$I21)/0.075))/(6343*'AMCA 208 Tables'!$F$5),($J21+'AMCA 208 Tables'!$F$3)*($K21+'AMCA 208 Tables'!$F$4*(IF($I21=0,0.075,$I21)/0.075))/(6343*'AMCA 208 Tables'!$F$6))))","v":2.5227432779709584},0.93036886669545638,{"$f":"'AMCA 208 Tables'!F$9*(LOG(M21/N21*0.746))^4+'AMCA 208 Tables'!F$10*(LOG(M21/N21*0.746))^3+'AMCA 208 Tables'!F$11*(LOG(M21/N21*0.746))^2+'AMCA 208 Tables'!F$12*LOG(M21/N21*0.746)+'AMCA 208 Tables'!F$13","v":0.88263773838868909},2.2917868530863448,1.97,"V-Belt",0.92467207376528615,{"$f":"'AMCA 208 Tables'!F$9*(LOG(Q21/S21*0.746))^4+'AMCA 208 Tables'!F$10*(LOG(Q21/S21*0.746))^3+'AMCA 208 Tables'!F$11*(LOG(Q21/S21*0.746))^2+'AMCA 208 Tables'!F$12*LOG(Q21/S21*0.746)+'AMCA 208 Tables'!F$13","v":0.87283739846945685},1.8208910691050848,1.2586073335033114]
[null,"ABC",270,"Centrifugal Housed",{"$f":"VLOOKUP(D22,'AMCA 208 Tables'!$A$17:$G$27,5,FALSE)","v":"B or D"},{"$f":"VLOOKUP(D22,'AMCA 208 Tables'!$A$17:$G$27,6,FALSE)","v":"Total"},27,4.1900000000000004,7.4999999999999997E-2,5000,2,2.0886189853509212,{"$f":"IF(D22=\"Circulating\",($J22+'AMCA 208 Tables'!$I$3)*($L22+'AMCA 208 Tables'!$I$4*(IF($I22=0,0.075,$I22)/0.075))/(6343*'AMCA 208 Tables'!$I$5),(IF(F22=\"Total\",($J22+'AMCA 208 Tables'!$F$3)*($L22+'AMCA 208 Tables'!$F$4*(IF($I22=0,0.075,$I22)/0.075))/(6343*'AMCA 208 Tables'!$F$5),($J22+'AMCA 208 Tables'!$F$3)*($K22+'AMCA 208 Tables'!$F$4*(IF($I22=0,0.075,$I22)/0.075))/(6343*'AMCA 208 Tables'!$F$6))))","v":3.1208943462113652},0.93472951157251583,{"$f":"'AMCA 208 Tables'!F$9*(LOG(M22/N22*0.746))^4+'AMCA 208 Tables'!F$10*(LOG(M22/N22*0.746))^3+'AMCA 208 Tables'!F$11*(LOG(M22/N22*0.746))^2+'AMCA 208 Tables'!F$12*LOG(M22/N22*0.746)+'AMCA 208 Tables'!F$13","v":0.89018778526057951},2.7980167404004939,2.65,"V-Belt",0.93142188877755094,{"$f":"'AMCA 208 Tables'!F$9*(LOG(Q22/S22*0.746))^4+'AMCA 208 Tables'!F$10*(LOG(Q22/S22*0.746))^3+'AMCA 208 Tables'!F$11*(LOG(Q22/S22*0.746))^2+'AMCA 208 Tables'!F$12*LOG(Q22/S22*0.746)+'AMCA 208 Tables'!F$13","v":0.88445293444410666},2.3997363742730968,1.1659683831929413]
[null,"ABC",245,"Centrifugal Housed",{"$f":"VLOOKUP(D23,'AMCA 208 Tables'!$A$17:$G$27,5,FALSE)","v":"B or D"},{"$f":"VLOOKUP(D23,'AMCA 208 Tables'!$A$17:$G$27,6,FALSE)","v":"Total"},27,3.2330000000000001,7.4999999999999997E-2,5000,2,2.1488481392658878,{"$f":"IF(D23=\"Circulating\",($J23+'AMCA 208 Tables'!$I$3)*($L23+'AMCA 208 Tables'!$I$4*(IF($I23=0,0.075,$I23)/0.075))/(6343*'AMCA 208 Tables'!$I$5),(IF(F23=\"Total\",($J23+'AMCA 208 Tables'!$F$3)*($L23+'AMCA 208 Tables'!$F$4*(IF($I23=0,0.075,$I23)/0.075))/(6343*'AMCA 208 Tables'!$F$5),($J23+'AMCA 208 Tables'!$F$3)*($K23+'AMCA 208 Tables'!$F$4*(IF($I23=0,0.075,$I23)/0.075))/(6343*'AMCA 208 Tables'!$F$6))))","v":3.1964257260797897},0.93518849146138616,{"$f":"'AMCA 208 Tables'!F$9*(LOG(M23/N23*0.746))^4+'AMCA 208 Tables'!F$10*(LOG(M23/N23*0.746))^3+'AMCA 208 Tables'!F$11*(LOG(M23/N23*0.746))^2+'AMCA 208 Tables'!F$12*LOG(M23/N23*0.746)+'AMCA 208 Tables'!F$13","v":0.8909894009794872},2.8617504076235649,2.37,"Direct",1,{"$f":"'AMCA 208 Tables'!F$9*(LOG(Q23/S23*0.746))^4+'AMCA 208 Tables'!F$10*(LOG(Q23/S23*0.746))^3+'AMCA 208 Tables'!F$11*(LOG(Q23/S23*0.746))^2+'AMCA 208 Tables'!F$12*LOG(Q23/S23*0.746)+'AMCA 208 Tables'!F$13","v":0.87731448125661837},2.0152636685850469,1.4200377113099307]
[null,"ABC",122,"Centrifugal Housed",{"$f":"VLOOKUP(D24,'AMCA 208 Tables'!$A$17:$G$27,5,FALSE)","v":"B or D"},{"$f":"VLOOKUP(D24,'AMCA 208 Tables'!$A$17:$G$27,6,FALSE)","v":"Total"},12.25,1.55,7.4999999999999997E-2,5000,2,2.6475770109133432,{"$f":"IF(D24=\"Circulating\",($J24+'AMCA 208 Tables'!$I$3)*($L24+'AMCA 208 Tables'!$I$4*(IF($I24=0,0.075,$I24)/0.075))/(6343*'AMCA 208 Tables'!$I$5),(IF(F24=\"Total\",($J24+'AMCA 208 Tables'!$F$3)*($L24+'AMCA 208 Tables'!$F$4*(IF($I24=0,0.075,$I24)/0.075))/(6343*'AMCA 208 Tables'!$F$5),($J24+'AMCA 208 Tables'!$F$3)*($K24+'AMCA 208 Tables'!$F$4*(IF($I24=0,0.075,$I24)/0.075))/(6343*'AMCA 208 Tables'!$F$6))))","v":3.8218650259400846},0.93842258081719454,{"$f":"'AMCA 208 Tables'!F$9*(LOG(M24/N24*0.746))^4+'AMCA 208 Tables'!F$10*(LOG(M24/N24*0.746))^3+'AMCA 208 Tables'!F$11*(LOG(M24/N24*0.746))^2+'AMCA 208 Tables'!F$12*LOG(M24/N24*0.746)+'AMCA 208 Tables'!F$13","v":0.89670071410620411},3.3881935215592698,3.94,"V-Belt",0.93893953439506084,{"$f":"'AMCA 208 Tables'!F$9*(LOG(Q24/S24*0.746))^4+'AMCA 208 Tables'!F$10*(LOG(Q24/S24*0.746))^3+'AMCA 208 Tables'!F$11*(LOG(Q24/S24*0.746))^2+'AMCA 208 Tables'!F$12*LOG(Q24/S24*0.746)+'AMCA 208 Tables'!F$13","v":0.89762656939284313},{"$f":"Q24*(1/S24)*(1/T24)*0.746","v":3.4873996905368343},{"$f":"P24/U24","v":0.97155296846336159}]
[null,"ABC",182,"Centrifugal Housed",{"$f":"VLOOKUP(D25,'AMCA 208 Tables'!$A$17:$G$27,5,FALSE)","v":"B or D"},{"$f":"VLOOKUP(D25,'AMCA 208 Tables'!$A$17:$G$27,6,FALSE)","v":"Total"},18.25,3.45,7.4999999999999997E-2,5000,2,2.1307123519192865,{"$f":"IF(D25=\"Circulating\",($J25+'AMCA 208 Tables'!$I$3)*($L25+'AMCA 208 Tables'!$I$4*(IF($I25=0,0.075,$I25)/0.075))/(6343*'AMCA 208 Tables'!$I$5),(IF(F25=\"Total\",($J25+'AMCA 208 Tables'!$F$3)*($L25+'AMCA 208 Tables'!$F$4*(IF($I25=0,0.075,$I25)/0.075))/(6343*'AMCA 208 Tables'!$F$5),($J25+'AMCA 208 Tables'!$F$3)*($K25+'AMCA 208 Tables'!$F$4*(IF($I25=0,0.075,$I25)/0.075))/(6343*'AMCA 208 Tables'!$F$6))))","v":3.1736822380138103},0.93505209159011193,{"$f":"'AMCA 208 Tables'!F$9*(LOG(M25/N25*0.746))^4+'AMCA 208 Tables'!F$10*(LOG(M25/N25*0.746))^3+'AMCA 208 Tables'!F$11*(LOG(M25/N25*0.746))^2+'AMCA 208 Tables'!F$12*LOG(M25/N25*0.746)+'AMCA 208 Tables'!F$13","v":0.89075098868601543},2.8425633329926048,2.21,"V-Belt",0.92740389861979566,{"$f":"'AMCA 208 Tables'!F$9*(LOG(Q25/S25*0.746))^4+'AMCA 208 Tables'!F$10*(LOG(Q25/S25*0.746))^3+'AMCA 208 Tables'!F$11*(LOG(Q25/S25*0.746))^2+'AMCA 208 Tables'!F$12*LOG(Q25/S25*0.746)+'AMCA 208 Tables'!F$13","v":0.87753783928038498},2.0257989031961507,1.4031813959953408]
[null,"ABC",300,"Centrifugal Housed",{"$f":"VLOOKUP(D26,'AMCA 208 Tables'!$A$17:$G$27,5,FALSE)","v":"B or D"},{"$f":"VLOOKUP(D26,'AMCA 208 Tables'!$A$17:$G$27,6,FALSE)","v":"Total"},30,5.17,7.4999999999999997E-2,6000,2,2.0838177937347142,{"$f":"IF(D26=\"Circulating\",($J26+'AMCA 208 Tables'!$I$3)*($L26+'AMCA 208 Tables'!$I$4*(IF($I26=0,0.075,$I26)/0.075))/(6343*'AMCA 208 Tables'!$I$5),(IF(F26=\"Total\",($J26+'AMCA 208 Tables'!$F$3)*($L26+'AMCA 208 Tables'!$F$4*(IF($I26=0,0.075,$I26)/0.075))/(6343*'AMCA 208 Tables'!$F$5),($J26+'AMCA 208 Tables'!$F$3)*($K26+'AMCA 208 Tables'!$F$4*(IF($I26=0,0.075,$I26)/0.075))/(6343*'AMCA 208 Tables'!$F$6))))","v":3.7081825373812132},0.93790012345498419,{"$f":"'AMCA 208 Tables'!F$9*(LOG(M26/N26*0.746))^4+'AMCA 208 Tables'!F$10*(LOG(M26/N26*0.746))^3+'AMCA 208 Tables'!F$11*(LOG(M26/N26*0.746))^2+'AMCA 208 Tables'!F$12*LOG(M26/N26*0.746)+'AMCA 208 Tables'!F$13","v":0.89576915848028704},3.292662619703445,2.4700000000000002,"V-Belt",{"$f":"IF($R26=\"Direct\",1,IF($R26=\"Coupling\",0.98,IF($R26=\"V-Belt\",0.96*(Q26/(Q26+2.2))^0.05,IF($R26=\"Synch Belt\",IF(Q26<=1.34,0.94,IF(Q26<=6.7,(0.00746*Q26+0.93),0.98)),\"Missing Transmission Type\"))))","v":0.92990854110161847},{"$f":"'AMCA 208 Tables'!F$9*(LOG(Q26/S26*0.746))^4+'AMCA 208 Tables'!F$10*(LOG(Q26/S26*0.746))^3+'AMCA 208 Tables'!F$11*(LOG(Q26/S26*0.746))^2+'AMCA 208 Tables'!F$12*LOG(Q26/S26*0.746)+'AMCA 208 Tables'!F$13","v":0.88184517358271464},{"$f":"Q26*(1/S26)*(1/T26)*0.746","v":2.2470006690906228},{"$f":"P26/U26","v":1.4653589849779658}]
[null,"ABC",270,"Centrifugal Housed",{"$f":"VLOOKUP(D27,'AMCA 208 Tables'!$A$17:$G$27,5,FALSE)","v":"B or D"},{"$f":"VLOOKUP(D27,'AMCA 208 Tables'!$A$17:$G$27,6,FALSE)","v":"Total"},27,4.1900000000000004,7.4999999999999997E-2,6500,2.5,2.6497660852430567,{"$f":"IF(D27=\"Circulating\",($J27+'AMCA 208 Tables'!$I$3)*($L27+'AMCA 208 Tables'!$I$4*(IF($I27=0,0.075,$I27)/0.075))/(6343*'AMCA 208 Tables'!$I$5),(IF(F27=\"Total\",($J27+'AMCA 208 Tables'!$F$3)*($L27+'AMCA 208 Tables'!$F$4*(IF($I27=0,0.075,$I27)/0.075))/(6343*'AMCA 208 Tables'!$F$5),($J27+'AMCA 208 Tables'!$F$3)*($K27+'AMCA 208 Tables'!$F$4*(IF($I27=0,0.075,$I27)/0.075))/(6343*'AMCA 208 Tables'!$F$6))))","v":4.9173560630880697},0.94241432999806307,{"$f":"'AMCA 208 Tables'!F$9*(LOG(M27/N27*0.746))^4+'AMCA 208 Tables'!F$10*(LOG(M27/N27*0.746))^3+'AMCA 208 Tables'!F$11*(LOG(M27/N27*0.746))^2+'AMCA 208 Tables'!F$12*LOG(M27/N27*0.746)+'AMCA 208 Tables'!F$13","v":0.90398483080991099},4.3059349021363564,3.19,"V-Belt",0.93515010925046227,{"$f":"'AMCA 208 Tables'!F$9*(LOG(Q27/S27*0.746))^4+'AMCA 208 Tables'!F$10*(LOG(Q27/S27*0.746))^3+'AMCA 208 Tables'!F$11*(LOG(Q27/S27*0.746))^2+'AMCA 208 Tables'!F$12*LOG(Q27/S27*0.746)+'AMCA 208 Tables'!F$13","v":0.89092229652493693},2.8563298186962633,1.5075061969215262]
[null,"ABC",165,"Centrifugal Housed",{"$f":"VLOOKUP(D28,'AMCA 208 Tables'!$A$17:$G$27,5,FALSE)","v":"B or D"},{"$f":"VLOOKUP(D28,'AMCA 208 Tables'!$A$17:$G$27,6,FALSE)","v":"Total"},20,2.2999999999999998,7.4999999999999997E-2,6500,2.5,2.9970337181730868,{"$f":"IF(D28=\"Circulating\",($J28+'AMCA 208 Tables'!$I$3)*($L28+'AMCA 208 Tables'!$I$4*(IF($I28=0,0.075,$I28)/0.075))/(6343*'AMCA 208 Tables'!$I$5),(IF(F28=\"Total\",($J28+'AMCA 208 Tables'!$F$3)*($L28+'AMCA 208 Tables'!$F$4*(IF($I28=0,0.075,$I28)/0.075))/(6343*'AMCA 208 Tables'!$F$5),($J28+'AMCA 208 Tables'!$F$3)*($K28+'AMCA 208 Tables'!$F$4*(IF($I28=0,0.075,$I28)/0.075))/(6343*'AMCA 208 Tables'!$F$6))))","v":5.4772805138731631},0.9439285278790609,{"$f":"'AMCA 208 Tables'!F$9*(LOG(M28/N28*0.746))^4+'AMCA 208 Tables'!F$10*(LOG(M28/N28*0.746))^3+'AMCA 208 Tables'!F$11*(LOG(M28/N28*0.746))^2+'AMCA 208 Tables'!F$12*LOG(M28/N28*0.746)+'AMCA 208 Tables'!F$13","v":0.90685285454684228},4.7734005060952445,6.52,"V-Belt",0.94614519594759328,{"$f":"'AMCA 208 Tables'!F$9*(LOG(Q28/S28*0.746))^4+'AMCA 208 Tables'!F$10*(LOG(Q28/S28*0.746))^3+'AMCA 208 Tables'!F$11*(LOG(Q28/S28*0.746))^2+'AMCA 208 Tables'!F$12*LOG(Q28/S28*0.746)+'AMCA 208 Tables'!F$13","v":0.91120446017456469},5.6417364921705744,0.84608710681890598]

{"sheet":"AMCA 208 Tables","index":3,"n_rows":30,"n_cols":9,"rows_kept":30,"cut":false,"hidden":false,"merged":[[1,4,1,5],[7,4,7,5],[1,7,1,8]]}
[]
[null,null,null,null,"FEPref Constants, section 5.2",null,null,"FEPref Constants, for ceiling fans"]
[null,null,null,null,"Q0",250,null,"Q0",16000]
[null,null,null,null,"P0",0.4,null,"P0",2.5000000000000001E-3]
[null,null,null,null,"η0,Total",0.66,null,"η0,Total",0.4]
[null,null,null,null,"η0,Static",0.6,null,"η0,Static"]
[]
[null,null,null,null,"Ref Mtr Constants, section 5.2"]
[null,null,null,null,"A",-3.8E-3]
[null,null,null,null,"B",2.58E-2]
[null,null,null,null,"C",-7.2599999999999998E-2]
[null,null,null,null,"D",0.12559999999999999]
[null,null,null,null,"E",0.85029999999999994]
[]
["AMCA 208 Annex A, Table A.2 (draft, for lookup)"]
["Fan Category","Housing Type","Impeller Type","Test Standard","Test Config/\nInstallation Type","FEI Pressure Basis","Notes"]
["Centrifugal Housed","SW or DW Scroll (not inline)","AF, BC, BI, MF, FC, \nRadial, Radial Tipped","AMCA 210, ISO 5801","B or D","Total",1]
["Centrifugal Inline","Square, Rect, Cylindrical","AF, BC, BI, MF, FC","AMCA 210, ISO 5801","B or D","Total",1]
["Centrifugal Unhoused","None","AF, BC, BI, MF","AMCA 210, ISO 5801","A","Static",2]
["Centrifugal PRV Exhaust","Spun Alum, Upblast, Hooded, Wall Housing","AF, BC, BI, MF, FC","AMCA 210, ISO 5801","A or C","Static",3]
["Centrifugal PRV Supply","Hooded or otherwise enclosed","AF, BC, BI, MF, FC","AMCA 210, ISO 5801","B or D","Total",3]
["Axial Inline","Cylindrical","Propeller","AMCA 210, ISO 5801","B or D","Total",1]
["Axial Panel","Panel, Ring","Propeller","AMCA 210, ISO 5801","A","Static"]
["Axial PRV","Sup & Ex, Spun Alum, Upblast, Hooded, Wall Housing","Propeller","AMCA 210, ISO 5801","A or C","Static"]
["Laboratory Exhaust","High Velocity Discharge, Induced Flow","Any","AMCA 210, AMCA 260, ISO 5801","A or C","Total","4,5"]
["Jet Fan","Unidirectional, Reversible","Propeller or AF, BC, BI","AMCA 250,","E","Total","4,6"]
["Circulating","Cylindrical, Panel, Unhoused","Propeller","AMCA 230","E","Total","4,7"]
[]
[]
["AMCA 208 Annex A, Table A.2 (draft, complete)"]

{"sheet":"AMCA 207 Tables","index":4,"n_rows":481,"n_cols":13,"rows_kept":481,"cut":false,"hidden":false,"merged":[[211,0,211,3],[244,0,244,12],[245,0,246,0],[447,0,447,3],[448,1,448,3],[362,0,362,4],[363,1,363,4],[387,0,387,4],[388,1,388,4],[417,0,417,4],[418,1,418,4],[339,1,339,4],[273,0,273,12],[274,0,275,0],[274,1,274,3],[337,0,337,4],[338,0,338,4],[245,1,245,3],[245,7,245,9],[245,10,245,12],[245,4,245,6],[274,7,274,9],[274,10,274,12],[306,0,307,2],[308,0,308,2],[309,1,309,2],[150,1,150,3],[150,4,150,6],[150,7,150,9],[121,10,121,12],[149,0,149,12],[150,10,150,12],[183,0,183,3],[120,0,120,12],[59,0,61,0],[59,1,59,3],[59,4,59,6],[59,7,59,9],[90,0,90,9],[91,0,92,0],[91,1,91,3],[91,4,91,6],[91,7,91,9],[121,4,121,6],[121,0,122,0],[121,1,121,3],[121,7,121,9],[150,0,151,0],[0,0,0,4],[1,1,1,4],[29,0,29,4],[30,1,30,4],[58,0,58,9]]}
["Table A1.  EISA 2007 Nominal Motor Effciency"]
["Motor Power (hp)","ODP"]
[null,2,4,6,8]
[1,0.77,0.85499999999999998,0.82499999999999996,0.755]
[1.5,0.84,0.86499999999999999,0.86499999999999999,0.78500000000000003]
[2,0.85499999999999998,0.86499999999999999,0.875,0.84]
[3,0.85499999999999998,0.89500000000000002,0.88500000000000001,0.85499999999999998]
[5,0.86499999999999999,0.89500000000000002,0.89500000000000002,0.86499999999999999]
[7.5,0.88500000000000001,0.91,0.90200000000000002,0.86499999999999999]
[10,0.89500000000000002,0.91700000000000004,0.91700000000000004,0.89500000000000002]
[15,0.90200000000000002,0.93,0.91700000000000004,0.89500000000000002]
[20,0.91,0.93,0.92400000000000004,0.90200000000000002]
[25,0.91700000000000004,0.93600000000000005,0.93,0.90200000000000002]
[30,0.91700000000000004,0.94099999999999995,0.93600000000000005,0.91700000000000004]
[40,0.92400000000000004,0.94099999999999995,0.94099999999999995,0.91700000000000004]
[50,0.93,0.94499999999999995,0.94099999999999995,0.92400000000000004]
[60,0.93600000000000005,0.95,0.94499999999999995,0.92400000000000004]
[75,0.93600000000000005,0.95,0.94499999999999995,0.93600000000000005]
[100,0.93600000000000005,0.95399999999999996,0.95,0.94099999999999995]
[125,0.94099999999999995,0.95399999999999996,0.95,0.94099999999999995]
[150,0.94099999999999995,0.95799999999999996,0.95399999999999996,0.94499999999999995]
[200,0.95,0.95799999999999996,0.95399999999999996,0.94499999999999995]
[250,0.95,0.95799999999999996,0.95799999999999996,0.95]
[300,0.95399999999999996,0.95799999999999996,0.95799999999999996]
[350,0.95399999999999996,0.95799999999999996,0.95499999999999996]
[400,0.95799999999999996,0.95799999999999996]
[450,0.96199999999999997,0.96199999999999997]
[500,0.96199999999999997,0.96199999999999997]
[]
["Table A1.  EISA 2007 Nominal Motor Effciency"]
["Motor Power (hp)","TEFC"]
[null,2,4,6,8]
[1,0.77,0.85499999999999998,0.82499999999999996,0.72]
[1.5,0.84,0.86499999999999999,0.875,0.755]
[2,0.85499999999999998,0.86499999999999999,0.88500000000000001,0.81499999999999995]
[3,0.86499999999999999,0.89500000000000002,0.89500000000000002,0.82499999999999996]
[5,0.88500000000000001,0.89500000000000002,0.89500000000000002,0.84]
[7.5,0.89500000000000002,0.91700000000000004,0.91,0.84]
[10,0.90200000000000002,0.91700000000000004,0.91,0.875]
[15,0.91,0.92400000000000004,0.91700000000000004,0.875]
[20,0.91,0.93,0.91700000000000004,0.88500000000000001]
[25,0.91700000000000004,0.93600000000000005,0.93,0.88500000000000001]
[30,0.91700000000000004,0.93600000000000005,0.93,0.90200000000000002]
[40,0.92400000000000004,0.94099999999999995,0.94099999999999995,0.90200000000000002]
[50,0.93,0.94499999999999995,0.94099999999999995,0.91]
[60,0.93600000000000005,0.95,0.94499999999999995,0.91]
[75,0.93600000000000005,0.95399999999999996,0.94499999999999995,0.92400000000000004]
[100,0.94099999999999995,0.95399999999999996,0.95,0.92400000000000004]
[125,0.95,0.95399999999999996,0.95,0.93]
[150,0.95,0.95799999999999996,0.95799999999999996,0.93]
[200,0.95399999999999996,0.96199999999999997,0.95799999999999996,0.93600000000000005]
[250,0.95799999999999996,0.96199999999999997,0.95799999999999996,0.94099999999999995]
[300,0.95799999999999996,0.96199999999999997]
[350,0.95799999999999996,0.96199999999999997]
[400,0.95799999999999996,0.96199999999999997]
[450,0.95799999999999996,0.96199999999999997]
[500,0.95799999999999996,0.96199999999999997]
[]
["Table A2.  IEC60034-30 Nominal Motor Efficiency"]
["Motor Power (kW)","IE1",null,null,"IE2",null,null,"IE3"]
[null,"2 Pole","4 Pole","6 Pole","2 Pole","4 Pole","6 Pole","2 Pole","4 Pole","6 Pole"]
[null,"50 Hz","50 Hz","50 Hz","50 Hz","50 Hz","50 Hz","50 Hz","50 Hz","50 Hz"]
[1,72.099999999999994,72.099999999999994,70,77.400000000000006,79.599999999999994,75.900000000000006,80.7,82.5,78.900000000000006]
[1.1000000000000001,75,75,72.900000000000006,79.599999999999994,81.400000000000006,78.099999999999994,82.7,84.1,81]
[1.5,77.2,77.2,75.2,81.3,82.8,79.8,84.2,85.3,82.5]
[2.2000000000000002,79.7,79.7,77.7,83.2,84.3,81.8,85.9,86.7,84.3]
[3,81.5,81.5,79.7,84.6,85.5,83.3,87.1,87.7,85.6]
[4,83.1,83.1,81.400000000000006,85.8,86.6,84.6,88.1,88.6,86.8]
[5.5,84.7,84.7,83.1,87,87.7,86,89.2,89.6,88]
[7.5,86,86,84.7,88.1,88.7,87.2,90.1,90.4,89.1]
[11,87.6,87.6,86.4,89.4,89.8,88.7,91.2,91.4,90.3]
[15,88.7,88.7,87.7,90.3,90.6,89.7,91.9,92.1,91.2]
[18.5,89.3,89.3,88.6,90.9,91.2,90.4,92.4,92.6,91.7]
[22,89.9,89.9,89.2,91.3,91.6,90.9,92.7,93,92.2]
[30,90.7,90.7,90.2,92,92.3,91.7,93.3,93.6,92.9]
[37,91.2,91.2,90.8,92.5,92.7,92.2,93.7,93.9,93.3]
[45,91.7,91.7,91.4,92.9,93.1,92.7,94,94.2,93.7]
[55,92.1,92.1,91.9,93.2,93.5,93.1,94.3,94.6,94.1]
[75,92.7,92.7,92.6,93.8,94,93.7,94.7,95,94.6]
[90,93,93,92.9,94.1,94.2,94,95,95.2,94.9]
[110,93.3,93.3,93.3,94.3,94.5,94.3,95.2,95.4,95.1]
[132,93.5,93.5,93.5,94.6,94.7,94.6,95.4,95.6,95.4]
[160,93.8,93.8,93.8,94.8,94.9,94.8,95.6,95.8,95.6]
[200,94,94,94,95,95.1,95,95.8,96,95.8]
[220,94,94,94,95,95.1,95,95.8,96,95.8]
[250,94,94,94,95,95.1,95,95.8,96,95.8]
[300,94,94,94,95,95.1,95,95.8,96,95.8]
[330,94,94,94,95,95.1,95,95.8,96,95.8]
[375,94,94,94,95,95.1,95,95.8,96,95.8]
[]
["Table A3.  GB 18613-2012 Nominal Motor Efficiency"]
["Motor Power (kW)","Grade 1",null,null,"Grade 2",null,null,"Grade 3"]
[null,"2 Pole","4 Pole","6 Pole","2 Pole","4 Pole","6 Pole","2 Pole","4 Pole","6 Pole"]
[1,84.9,85.6,83.1,80.7,82.5,78.900000000000006,77.400000000000006,79.599999999999994,75.900000000000006]
[1.1000000000000001,86.7,87.4,84.1,82.7,84.1,81,79.599999999999994,81.400000000000006,78.099999999999994]
[1.5,87.5,88.1,86.2,84.2,85.3,82.5,81.3,82.8,79.8]
[2.2000000000000002,89.1,89.7,87.1,85.9,86.7,84.3,83.2,84.3,81.8]
[3,89.7,90.3,88.7,87.1,87.7,85.6,84.6,85.5,83.3]
[4,90.3,90.9,89.7,88.1,88.6,86.8,85.8,86.6,84.6]
[5.5,91.5,92.1,89.5,89.2,89.6,88,87,87.7,86]
[7.5,92.1,92.6,90.2,90.1,90.4,89.1,88.1,88.7,87.2]
[11,93,93.6,91.5,91.2,91.4,90.3,89.4,89.8,88.7]
[15,93.4,94,92.5,91.9,92.1,91.2,90.3,90.6,89.7]
[18.5,93.8,94.3,93.1,92.4,92.6,91.7,90.9,91.2,90.4]
[22,94.4,94.7,93.9,92.7,93,92.2,91.3,91.6,90.9]
[30,94.5,95,94.3,93.3,93.6,92.9,92,92.3,91.7]
[37,94.8,95.3,94.6,93.7,93.9,93.3,92.5,92.7,92.2]
[45,95.1,95.6,94.9,94,94.2,93.7,92.9,93.1,92.7]
[55,95.4,95.8,95.2,94.3,94.6,94.1,93.2,93.5,93.1]
[75,95.6,96,95.4,94.7,95,94.6,93.8,94,93.7]
[90,95.8,96.2,95.6,95,95.2,94.9,94.1,94.2,94]
[110,96,96.4,95.6,95.2,95.4,95.1,94.6,94.5,94.3]
[132,95,96.5,95.8,95.4,95.6,95.4,94.6,94.7,94.6]
[160,96.2,96.5,96,95.6,95.8,95.6,94.8,94.9,94.8]
[200,96.3,96.6,96.1,95.8,96,95.8,95,95.1,95]
[250,96.4,96.7,96.1,95.8,96,95.8,95,95.1,95]
[315,96.5,96.8,96.1,95.8,96,95.8,95,95.1,95]
[355,96.6,96.8,96.1,95.8,96,95.8,95,95.1,95]
[375,96.6,96.8,96.1,95.8,96,95.8,95,95.1,95]
[]
["Table B1. Polyphase Induction Motor Coefficients, VFD Driven (hp)"]
["HP","2 POLE",null,null,"4 POLE",null,null,"6 POLE",null,null,"8 POLE"]
[null,"a","b","c","a","b","c","a","b","c","a","b","c"]
[1,1.0290587089821184,1.7010581577560906E-2,{"$f":"1-(B124/(C124+1))","v":-1.1846609684108333E-2},1.0374399999999999,3.3369999999999997E-2,{"$f":"1-(E124/(F124+1))","v":-3.938569921712487E-3},1.0905912997124119,6.4569252594785076E-2,{"$f":"1-(H124/(I124+1))","v":-2.4443733514001531E-2},1.0905912997124119,6.4569252594785076E-2,{"$f":"1-(K124/(L124+1))","v":-2.4443733514001531E-2}]
[1.5,1.0299771331744125,1.6103178471842214E-2,{"$f":"1-(B125/(C125+1))","v":-1.3654080605707719E-2},1.0381199999999999,3.1196707536618764E-2,{"$f":"1-(E125/(F125+1))","v":-6.7138426769417503E-3},1.0848438439543235,5.9027745017881786E-2,{"$f":"1-(H125/(I125+1))","v":-2.437716958586944E-2},1.0848438439543235,5.9027745017881786E-2,{"$f":"1-(K125/(L125+1))","v":-2.437716958586944E-2}]
[2,1.0308955573667065,1.5195775366123527E-2,-1.5464782637536922E-2,1.0387999999999999,2.9020489849636892E-2,-9.5037078919508744E-3,1.0790963881962352,5.3486237440978489E-2,-2.4309905383734565E-2,1.0790963881962352,5.3486237440978489E-2,-2.4309905383734565E-2]
[3,1.0327324057512945,1.3380969154686151E-2,-1.9095914750353327E-2,1.04016,2.4668054475673148E-2,-1.5118989468500654E-2,1.0676014766800588,4.2403222287171902E-2,-2.4173231484835966E-2,1.0676014766800588,4.2403222287171902E-2,-2.4173231484835966E-2]
[5,1.0364061025204707,9.7513567318113972E-3,-2.6397335949050582E-2,1.04288,1.5963183727745658E-2,-2.6493889447343877E-2,1.0446116536477055,2.0237191979558734E-2,-2.3890975412152127E-2,1.0446116536477055,2.0237191979558734E-2,-2.3890975412152127E-2]
[7.5,1.0348922416940116,8.9161676043317383E-3,-2.5746513856904629E-2,1.04077,1.4463467280912556E-2,-2.5931473697714758E-2,1.042429389884002,1.7980813687747493E-2,-2.4016735745428175E-2,1.042429389884002,1.7980813687747493E-2,-2.4016735745428175E-2]
[10,1.0333783808675525,8.0809784768520795E-3,-2.5094613360251428E-2,1.0386599999999999,1.2963750834079454E-2,-2.5367392608829364E-2,1.0402471261202986,1.5724435395936251E-2,-2.4143054818606569E-2,1.0402471261202986,1.5724435395936251E-2,-2.4143054818606569E-2]
[15,1.0303506592146343,6.4106002218927618E-3,-2.3787566414208428E-2,1.03443,9.9643179404132511E-3,-2.4224303398637792E-2,1.0358825985928914,1.1211678812313771E-2,-2.4397384145675716E-2,1.0358825985928914,1.1211678812313771E-2,-2.4397384145675716E-2]
[20,1.0273229375617161,4.7402219669334441E-3,-2.2476173543220401E-2,1.0302100000000001,6.964885046747046E-3,-2.3084335212120166E-2,1.0315180710654845,6.6989222286912885E-3,-2.4653993650700645E-2,1.0315180710654845,6.6989222286912885E-3,-2.4653993650700645E-2]
[25,1.0265367998200667,4.7580121918819607E-3,-2.1675654599334182E-2,1.0288200000000001,6.4211833827768228E-3,-2.2255907354748361E-2,1.0297743857954778,6.2231264190406544E-3,-2.3405603347889326E-2,1.0297743857954778,6.2231264190406544E-3,-2.3405603347889326E-2]
[30,1.0257506620784176,4.7758024168304781E-3,-2.0875164002890356E-2,1.02742,5.8774817188066006E-3,-2.1416642357260374E-2,1.028030700525471,5.7473306093900204E-3,-2.2156031875897986E-2,1.028030700525471,5.7473306093900204E-3,-2.2156031875897986E-2]
[40,1.0241783865951188,4.8113828667275113E-3,-1.9274267846306925E-2,1.02464,4.7900783908661551E-3,-1.9755292210809738E-2,1.0245433299854576,4.7957389900887522E-3,-1.9653338712619206E-2,1.0245433299854576,4.7957389900887522E-3,-1.9653338712619206E-2]
[50,1.0226061111118203,4.8469633166245453E-3,-1.7673485061425964E-2,1.0218499999999999,3.7026750629257088E-3,-1.8080379168000649E-2,1.021055959445444,3.8441473707874836E-3,-1.7145900705539452E-2,1.021055959445444,3.8441473707874836E-3,-1.7145900705539452E-2]
[60,1.0222592723783495,4.4887785628977151E-3,-1.7691082463733965E-2,1.0209999999999999,3.4998956071213604E-3,-1.7439069470247537E-2,1.0205727134858866,3.98605499083111E-3,-1.6520805655221071E-2,1.0205727134858866,3.98605499083111E-3,-1.6520805655221071E-2]
[75,1.0217390142781433,3.9515014323074698E-3,-1.7717502110867756E-2,1.01972,3.1957264234148373E-3,-1.6471634738215446E-2,1.0198478445465504,4.1989164208965498E-3,-1.5583494335393855E-2,1.0198478445465504,4.1989164208965498E-3,-1.5583494335393855E-2]
[100,1.0208719174444665,3.0560395479903944E-3,-1.7761597751312586E-2,1.0175799999999999,2.6887777839039663E-3,-1.4851290396415751E-2,1.018639729647657,4.5536854710056156E-3,-1.4022191526824157E-2,1.018639729647657,4.5536854710056156E-3,-1.4022191526824157E-2]
[125,1.019970936000357,2.9929661760623523E-3,-1.6927306967090328E-2,1.01725,2.8575602516980924E-3,-1.4351429673312488E-2,1.019555448387369,4.5855543449009138E-3,-1.4901562119544964E-2,1.019555448387369,4.5855543449009138E-3,-1.4901562119544964E-2]
[150,1.0190699545562476,2.9298928041343103E-3,-1.6092911247252317E-2,1.01692,3.0263427194922184E-3,-1.3851737176551193E-2,1.0204711671270807,4.6174232187962119E-3,-1.5780876920777676E-2,1.0204711671270807,4.6174232187962119E-3,-1.5780876920777676E-2]
[200,1.0172679916680287,2.8037460602782262E-3,-1.4423804921527505E-2,1.0162599999999999,3.3600000000000001E-3,-1.285680114814225E-2,1.0223026046065045,4.6811609665868082E-3,-1.7539339170015156E-2,1.0223026046065045,4.6811609665868082E-3,-1.7539339170015156E-2]
[250,1.0172679916680287,2.8037460602782262E-3,-1.4423804921527505E-2,1.0162599999999999,3.3600000000000001E-3,-1.285680114814225E-2,1.0223026046065045,4.6811609665868082E-3,-1.7539339170015156E-2,1.0223026046065045,4.6811609665868082E-3,-1.7539339170015156E-2]
[300,1.0172679916680287,2.8037460602782262E-3,-1.4423804921527505E-2,1.0162599999999999,3.3600000000000001E-3,-1.285680114814225E-2,1.0223026046065045,4.6811609665868082E-3,-1.7539339170015156E-2,1.0223026046065045,4.6811609665868082E-3,-1.7539339170015156E-2]
[350,1.0172679916680287,2.8037460602782262E-3,-1.4423804921527505E-2,1.0162599999999999,3.3600000000000001E-3,-1.285680114814225E-2,1.0223026046065045,4.6811609665868082E-3,-1.7539339170015156E-2,1.0223026046065045,4.6811609665868082E-3,-1.7539339170015156E-2]
[400,1.0172679916680287,2.8037460602782262E-3,-1.4423804921527505E-2,1.0162599999999999,3.3600000000000001E-3,-1.285680114814225E-2,1.0223026046065045,4.6811609665868082E-3,-1.7539339170015156E-2,1.0223026046065045,4.6811609665868082E-3,-1.7539339170015156E-2]
[450,1.0172679916680287,2.8037460602782262E-3,-1.4423804921527505E-2,1.0162599999999999,3.3600000000000001E-3,-1.285680114814225E-2,1.0223026046065045,4.6811609665868082E-3,-1.7539339170015156E-2,1.0223026046065045,4.6811609665868082E-3,-1.7539339170015156E-2]
[500,1.0172679916680287,2.8037460602782262E-3,-1.4423804921527505E-2,1.0162599999999999,3.3600000000000001E-3,-1.285680114814225E-2,1.0223026046065045,4.6811609665868082E-3,-1.7539339170015156E-2,1.0223026046065045,4.6811609665868082E-3,-1.7539339170015156E-2]
[]
["Table B2. Polyphase Induction Motor Coefficients, VFD Driven (kW)"]
["kW","2 POLE",null,null,"4 POLE",null,null,"6 POLE",null,null,"8 POLE"]
[null,"a","b","c","a","b","c","a","b","c","a","b","c"]
[1,1.0296841238476484,1.6392671687875792E-2,{"$f":"1-(B153/(C153+1))","v":-1.3077083818107571E-2},1.0379070376490189,3.1890996825495017E-2,{"$f":"1-(E153/(F153+1))","v":-5.8301127173623346E-3},1.0866774826546253,6.0795679070566752E-2,{"$f":"1-(H153/(I153+1))","v":-2.439848134254774E-2},1.0866774826546253,6.0795679070566752E-2,{"$f":"1-(K153/(L153+1))","v":-2.439848134254774E-2}]
[1.1000000000000001,1.0299303501726602,1.614940007776354E-2,{"$f":"1-(B154/(C154+1))","v":-1.3561933012844474E-2},1.0380892170512896,3.1307560448288078E-2,{"$f":"1-(E154/(F154+1))","v":-6.5757848221861259E-3},1.0851366097972288,5.9310020202764255E-2,{"$f":"1-(H154/(I154+1))","v":-2.4380577075558074E-2},1.0851366097972288,5.9310020202764255E-2,{"$f":"1-(K154/(L154+1))","v":-2.4380577075558074E-2}]
[1.5,1.0309152554727075,1.5176313637314547E-2,-1.5503653526943717E-2,1.0388179346603734,2.8973814939460336E-2,-9.5669292823474805E-3,1.0789731183676434,5.3367384731554286E-2,-2.4308454967603366E-2,1.0789731183676434,5.3367384731554286E-2,-2.4308454967603366E-2]
[2.2000000000000002,1.0326388397477901,1.3473412366528804E-2,-1.8910636576551898E-2,1.0400931904762694,2.4889760299011784E-2,-1.4834210240155077E-2,1.0681870083658693,4.2967772656936846E-2,-2.4180263638143851E-2,1.0681870083658693,4.2967772656936846E-2,-2.4180263638143851E-2]
[3,1.0346086503478846,1.1527239485630815E-2,-2.2818377954894276E-2,1.0415506256944365,2.0222269281356293E-2,-2.0905597785180419E-2,1.0558600255066988,3.1082501714516916E-2,-2.4030592848759413E-2,1.0558600255066988,3.1082501714516916E-2,-2.4030592848759413E-2]
[3.7,1.0363322346229671,9.8243382148450707E-3,-2.62500074567249E-2,1.0428258815103326,1.6138214640907738E-2,-2.6263815773188037E-2,1.0450739155049245,2.068288963989948E-2,-2.3896771575773412E-2,1.0450739155049245,2.068288963989948E-2,-2.3896771575773412E-2]
[4,1.0361869376823238,9.6304446329269419E-3,-2.6303181714228296E-2,1.0425747616043206,1.5746066601394486E-2,-2.6412797336929694E-2,1.0442957227006813,1.9910531315328689E-2,-2.3909147554250776E-2,1.0442957227006813,1.9910531315328689E-2,-2.3909147554250776E-2]
[5.5,1.0349693552481745,8.9587107502355282E-3,-2.5779691696796947E-2,1.040876018678246,1.4539860343887968E-2,-2.5958722139740376E-2,1.0425405507727699,1.8095749847383991E-2,-2.4010316248791241E-2,1.0425405507727699,1.8095749847383991E-2,-2.4010316248791241E-2]
[7.5,1.0333459120026418,8.0630655733136426E-3,-2.5080619747683386E-2,1.0386110281101464,1.2931585333879281E-2,-2.5351606315842989E-2,1.0402003215355542,1.5676041223457726E-2,-2.4145770222713026E-2,1.0402003215355542,1.5676041223457726E-2,-2.4145770222713026E-2]
[11,1.03050488632296,6.4956865137003406E-3,-2.3854250078728878E-2,1.0346472946159726,1.0117104066364076E-2,-2.4284501718522478E-2,1.0361049203704269,1.1441551131586767E-2,-2.4384374174906132E-2,1.0361049203704269,1.1441551131586767E-2,-2.4384374174906132E-2]
[15,1.0273060766986244,4.7406035267178624E-3,-2.2459003938628541E-2,1.0301780444544386,6.9532238850533151E-3,-2.306444829659382E-2,1.0314806729899884,6.6887174928274683E-3,-2.462723090699348E-2,1.0314806729899884,6.6887174928274683E-3,-2.462723090699348E-2]
[18.5,1.0265684139383637,4.7572967672861758E-3,-2.1707846503083772E-2,1.0288712911018636,6.4430480609525692E-3,-2.2284661893310354E-2,1.029844507187033,6.242260298785318E-3,-2.3455829495016012E-2,1.029844507187033,6.242260298785318E-3,-2.3455829495016012E-2]
[22,1.0258307511781031,4.7739900078544902E-3,-2.0956714026886702E-2,1.0275645377492888,5.9328722368518242E-3,-2.1504084526371425E-2,1.0282083413840775,5.7958031047431677E-3,-2.2283388149115568E-2,1.0282083413840775,5.7958031047431677E-3,-2.2283388149115568E-2]
[30,1.0241446648689354,4.8121459862963487E-3,-1.923993351380382E-2,1.0245776729434031,4.7667560674786924E-3,-1.9716931075090205E-2,1.0244685338344655,4.775329518361111E-3,-1.9599609721254074E-2,1.0244685338344655,4.775329518361111E-3,-1.9599609721254074E-2]
[37,1.0226693393484141,4.8455324674329756E-3,-1.7737857516482158E-2,1.0219641662382533,3.7464044192772007E-3,-1.814976545745739E-2,1.0211962022285546,3.8824151302768103E-3,-1.7246827753259364E-2,1.0211962022285546,3.8824151302768103E-3,-1.7246827753259364E-2]
[45,1.0222481140276749,4.4772551928046267E-3,-1.7691648808373595E-2,1.0209706961051401,3.493371871277789E-3,-1.741648198559731E-2,1.0205571666989839,3.9906203834330495E-3,-1.6500698292603477E-2,1.0205571666989839,3.9906203834330495E-3,-1.6500698292603477E-2]
[55,1.0217831827495638,3.9971147722592778E-3,-1.771525805762808E-2,1.019825939348137,3.2215495444623079E-3,-1.6551069712581912E-2,1.0199093839113733,4.1808450751805388E-3,-1.5663054033872914E-2,1.0199093839113733,4.1808450751805388E-3,-1.5663054033872914E-2]
[75,1.0208525934456651,3.0546867678954231E-3,-1.7743705216232364E-2,1.0175751148553083,2.6923977832132239E-3,-1.4842754472855546E-2,1.0186593697278654,4.5543689857272304E-3,-1.4041052607615123E-2,1.0186593697278654,4.5543689857272304E-3,-1.4041052607615123E-2]
[90,1.0201279434906174,3.0039575143339949E-3,-1.7072700309897604E-2,1.0173088180139649,2.8281477573103759E-3,-1.4439832277383324E-2,1.0193958727356767,4.5800007877877923E-3,-1.474832460955855E-2,1.0193958727356767,4.5800007877877923E-3,-1.474832460955855E-2]
[110,1.0191617435505536,2.9363185095854245E-3,-1.6177921510589943E-2,1.0169537555588406,3.009147722773246E-3,-1.390277234033932E-2,1.0203778767460914,4.6141765238685408E-3,-1.5691297804265369E-2,1.0203778767460914,4.6141765238685408E-3,-1.5691297804265369E-2]
[132,1.0180989236164835,2.8619156043619967E-3,-1.51935254246236E-2,1.0165631868582039,3.2082476847824027E-3,-1.33122302415698E-2,1.0214580811575478,4.6517698335573647E-3,-1.6728494219220735E-2,1.0214580811575478,4.6517698335573647E-3,-1.6728494219220735E-2]
[150,1.0172679916680287,2.8037460602782262E-3,-1.4423804921527505E-2,1.0162578331467969,3.3639076550804705E-3,-1.2850696933927264E-2,1.0223026046065045,4.6811609665868082E-3,-1.7539339170015156E-2,1.0223026046065045,4.6811609665868082E-3,-1.7539339170015156E-2]
[160,1.0172679916680287,2.8037460602782262E-3,-1.4423804921527505E-2,1.0162578331467969,3.3639076550804705E-3,-1.2850696933927264E-2,1.0223026046065045,4.6811609665868082E-3,-1.7539339170015156E-2,1.0223026046065045,4.6811609665868082E-3,-1.7539339170015156E-2]
[185,1.0172679916680287,2.8037460602782262E-3,-1.4423804921527505E-2,1.0162578331467969,3.3639076550804705E-3,-1.2850696933927264E-2,1.0223026046065045,4.6811609665868082E-3,-1.7539339170015156E-2,1.0223026046065045,4.6811609665868082E-3,-1.7539339170015156E-2]
[200,1.0172679916680287,2.8037460602782262E-3,-1.4423804921527505E-2,1.0162578331467969,3.3639076550804705E-3,-1.2850696933927264E-2,1.0223026046065045,4.6811609665868082E-3,-1.7539339170015156E-2,1.0223026046065045,4.6811609665868082E-3,-1.7539339170015156E-2]
[220,1.0172679916680287,2.8037460602782262E-3,-1.4423804921527505E-2,1.0162578331467969,3.3639076550804705E-3,-1.2850696933927264E-2,1.0223026046065045,4.6811609665868082E-3,-1.7539339170015156E-2,1.0223026046065045,4.6811609665868082E-3,-1.7539339170015156E-2]
[250,1.0172679916680287,2.8037460602782262E-3,-1.4423804921527505E-2,1.0162578331467969,3.3639076550804705E-3,-1.2850696933927264E-2,1.0223026046065045,4.6811609665868082E-3,-1.7539339170015156E-2,1.0223026046065045,4.6811609665868082E-3,-1.7539339170015156E-2]
[300,1.0172679916680287,2.8037460602782262E-3,-1.4423804921527505E-2,1.0162578331467969,3.3639076550804705E-3,-1.2850696933927264E-2,1.0223026046065045,4.6811609665868082E-3,-1.7539339170015156E-2,1.0223026046065045,4.6811609665868082E-3,-1.7539339170015156E-2]
[330,1.0172679916680287,2.8037460602782262E-3,-1.4423804921527505E-2,1.0162578331467969,3.3639076550804705E-3,-1.2850696933927264E-2,1.0223026046065045,4.6811609665868082E-3,-1.7539339170015156E-2,1.0223026046065045,4.6811609665868082E-3,-1.7539339170015156E-2]
[375,1.0172679916680287,2.8037460602782262E-3,-1.4423804921527505E-2,1.0162578331467969,3.3639076550804705E-3,-1.2850696933927264E-2,1.0223026046065045,4.6811609665868082E-3,-1.7539339170015156E-2,1.0223026046065045,4.6811609665868082E-3,-1.7539339170015156E-2]
[]
["Table C1. VFD Performance Coefficienct (hp capacity)"]
["HP","d","e","f"]
[1,0.98029999999999995,0.04,-1.3100000000000001E-2]
[1.5,0.97994999999999999,3.8550000000000001E-2,-1.1800000000000001E-2]
[2,0.97960000000000003,3.7100000000000001E-2,-1.0500000000000001E-2]
[3,0.97889999999999999,3.4200000000000001E-2,-7.9000000000000008E-3]
[5,0.97750000000000004,2.8400000000000002E-2,-2.7000000000000001E-3]
[7.5,0.97809999999999997,2.5300000000000003E-2,-4.0000000000000007E-4]
[10,0.97870000000000001,2.2200000000000001E-2,1.9E-3]
[15,0.98185,1.985E-2,6.9999999999999999E-4]
[20,0.98499999999999999,1.7500000000000002E-2,-5.0000000000000001E-4]
[25,0.98619999999999997,1.6500000000000001E-2,-3.1999999999999997E-3]
[30,0.98740000000000006,1.55E-2,-5.8999999999999999E-3]
[40,0.98765000000000003,1.695E-2,-3.8E-3]
[50,0.9879,1.84E-2,-1.6999999999999999E-3]
[60,0.97189999999999999,1.4500000000000001E-2,1.18E-2]
[75,0.9919,1.7899999999999999E-2,-1.2999999999999999E-3]
[100,0.98240000000000005,1.26E-2,1.4E-3]
[125,0.98292500000000005,1.1900000000000001E-2,-1.0000000000000005E-4]
[150,0.98345000000000005,1.12E-2,-1.6000000000000001E-3]
[200,0.98450000000000004,9.7999999999999997E-3,-4.5999999999999999E-3]
[250,0.98450000000000004,9.7999999999999997E-3,-4.5999999999999999E-3]
[300,0.98450000000000004,9.7999999999999997E-3,-4.5999999999999999E-3]
[350,0.98450000000000004,9.7999999999999997E-3,-4.5999999999999999E-3]
[400,0.98450000000000004,9.7999999999999997E-3,-4.5999999999999999E-3]
[450,0.98450000000000004,9.7999999999999997E-3,-4.5999999999999999E-3]
[500,0.98450000000000004,9.7999999999999997E-3,-4.5999999999999999E-3]
[]
["Table C2. VFD Performance Coefficients (kW capacity)"]
["kW","d","e","f"]
[1,0.98006166219839141,3.9012600536193029E-2,-1.2214745308310994E-2]
[1.1000000000000001,0.9799678284182306,3.8623860589812334E-2,-1.1866219839142092E-2]
[1.5,0.97959249329758713,3.7068900804289547E-2,-1.0472117962466488E-2]
[2.2000000000000002,0.97893565683646111,3.4347721179624667E-2,-8.0324396782841829E-3]
[3,0.97818498659517428,3.1237801608579089E-2,-5.2442359249329764E-3]
[3.7,0.97752815013404826,2.8516621983914209E-2,-2.8045576407506696E-3]
[4,0.97758686327077748,2.7951206434316356E-2,-2.3670241286863273E-3]
[5.5,0.97806943699731896,2.545790884718499E-2,-5.1715817694369948E-4]
[7.5,0.97873378016085788,2.2174798927613943E-2,1.8871313672922253E-3]
[11,0.98168954423592492,1.9969705093833778E-2,7.6112600536193007E-4]
[15,0.98502573726541554,1.7478552278820378E-2,-5.5790884718498663E-4]
[18.5,0.98615174262734584,1.6540214477211795E-2,-3.0914209115281508E-3]
[22,0.98727774798927614,1.5601876675603216E-2,-5.6249329758713143E-3]
[30,0.98765536193029491,1.6981099195710454E-2,-3.7549597855227883E-3]
[37,0.98788994638069705,1.8341689008042894E-2,-1.784450402144771E-3]
[45,0.97232895442359246,1.4572922252010725E-2,1.1519034852546914E-2]
[55,0.9902020554066131,1.7611349419124216E-2,-1.8784629133154415E-4]
[75,0.98241126005361934,1.2584986595174263E-2,1.3678284182305626E-3]
[90,0.98283351206434322,1.2021983914209116E-2,1.6139410187667553E-4]
[110,0.98339651474530831,1.1271313672922252E-2,-1.4471849865951741E-3]
[132,0.98401581769436997,1.0445576407506702E-2,-3.2166219839142095E-3]
[150,0.98450000000000004,9.7999999999999997E-3,-4.5999999999999999E-3]
[160,0.98450000000000004,9.7999999999999997E-3,-4.5999999999999999E-3]
[185,0.98450000000000004,9.7999999999999997E-3,-4.5999999999999999E-3]
[200,0.98450000000000004,9.7999999999999997E-3,-4.5999999999999999E-3]
[220,0.98450000000000004,9.7999999999999997E-3,-4.5999999999999999E-3]
[250,0.98450000000000004,9.7999999999999997E-3,-4.5999999999999999E-3]
[300,0.98450000000000004,9.7999999999999997E-3,-4.5999999999999999E-3]
[330,0.98450000000000004,9.7999999999999997E-3,-4.5999999999999999E-3]
[375,0.98450000000000004,9.7999999999999997E-3,-4.5999999999999999E-3]
[]
["Table D1. Polyphase Induction Motor Coefficients, DOL (hp)"]
["HP","2 POLE",null,null,"4 POLE",null,null,"6 POLE",null,null,"8 POLE"]
[null,"a","b","c","a","b","c","a","b","c","a","b","c"]
[1,1.1346000000000001,8.6738167906186978E-2,{"$f":"1-(B248/(C248+1))","v":-4.4041732872995842E-2},1.12541,9.1318214383920848E-2,{"$f":"1-(E248/(F248+1))","v":-3.1239087890899908E-2},1.1687285620318451,0.11466243314166571,{"$f":"1-(H248/(I248+1))","v":-4.8504486454965967E-2},1.1687285620318451,0.11466243314166571,{"$f":"1-(K248/(L248+1))","v":-4.8504486454965967E-2}]
[1.5,1.2931999999999999,8.1142483629434187E-2,{"$f":"1-(B249/(C249+1))","v":-0.19614206229199427},1.1206700000000001,8.4915245233653375E-2,{"$f":"1-(E249/(F249+1))","v":-3.2956265407300345E-2},1.158950925043136,0.10606458738136698,{"$f":"1-(H249/(I249+1))","v":-4.7814872897231631E-2},1.158950925043136,0.10606458738136698,{"$f":"1-(K249/(L249+1))","v":-4.7814872897231631E-2}]
[2,1.1240499704558535,7.5546799352681396E-2,-4.50962906796466E-2,1.11592,7.8512276083385901E-2,{"$f":"1-(E250/(F250+1))","v":-3.4684560153974475E-2},1.149173288054427,9.7466741621068248E-2,-4.711445410817916E-2,1.149173288054427,9.7466741621068248E-2,-4.711445410817916E-2]
[3,1.1135030046530503,6.4355430799175814E-2,-4.6175903680006458E-2,1.10643,6.570633778285094E-2,-3.8212836663684246E-2,1.1296180140770089,8.0271050100470781E-2,-4.568016885387105E-2,1.1296180140770089,8.0271050100470781E-2,-4.568016885387105E-2]
[5,1.0924090730474438,4.197269369216465E-2,-4.8404703559515427E-2,1.08745,4.009446118178104E-2,-4.5530036535732066E-2,1.0905074661221728,4.5879667059275833E-2,-4.2670108683131813E-2,1.0905074661221728,4.5879667059275833E-2,-4.2670108683131813E-2]
[7.5,1.0888348126879779,3.989909103363961E-2,-4.7058144464475982E-2,1.0833999999999999,3.7453687604279112E-2,-4.4287579238184271E-2,1.0857869917956742,4.2170186849640849E-2,-4.1851902401738972E-2,1.0857869917956742,4.2170186849640849E-2,-4.1851902401738972E-2]
[10,1.0852605523285119,3.7825488375114562E-2,-4.5706204448365151E-2,1.0712699999999999,3.4812914026777178E-2,-3.5230605918278535E-2,1.0810665174691756,3.8460706640005858E-2,-4.1027850699351998E-2,1.0810665174691756,3.8460706640005858E-2,-4.1027850699351998E-2]
[15,1.0781120316095798,3.367828305806448E-2,-4.2986052120647544E-2,1.06318,2.953136687177332E-2,-3.2683446285340256E-2,1.0716255688161782,3.104174622073589E-2,-3.9361958663848062E-2,1.0716255688161782,3.104174622073589E-2,-3.9361958663848062E-2]
[20,1.0709635108906479,2.9531077741014392E-2,-4.0243984902858854E-2,1.06033,2.4249819716769459E-2,-3.522595717244803E-2,1.062184620163181,2.3622785801465915E-2,-3.7671918695637796E-2,1.062184620163181,2.3622785801465915E-2,-3.7671918695637796E-2]
[25,1.0694923844806872,2.9225034973615917E-2,-3.9123950680138186E-2,1.05749,2.2909351548753371E-2,-3.3806170995396068E-2,1.0596586949335201,2.2571605445197398E-2,-3.6268452293055864E-2,1.0596586949335201,2.2571605445197398E-2,-3.6268452293055864E-2]
[30,1.0680212580707267,2.891899220621744E-2,-3.8003250169059255E-2,1.0518000000000001,2.1568883380737286E-2,-2.9592832271101654E-2,1.0571327697038591,2.1520425088928884E-2,-3.4862097458139285E-2,1.0571327697038591,2.1520425088928884E-2,-3.4862097458139285E-2]
[40,1.0650790052508055,2.8306906671420492E-2,-3.57598479022323E-2,1.0461199999999999,1.8887947044705113E-2,-2.6727230442053607E-2,1.0520809192445368,1.9418064376391854E-2,-3.2040686750166358E-2,1.0520809192445368,1.9418064376391854E-2,-3.2040686750166358E-2]
[50,1.0621367524308842,2.769482113662354E-2,-3.3513773336103947E-2,1.04436,1.6207010708672941E-2,-2.7703990421886537E-2,1.0470290687852148,1.731570366385482E-2,-2.9207614720138109E-2,1.0470290687852148,1.731570366385482E-2,-2.9207614720138109E-2]
[60,1.0594575801250499,2.5853313010673128E-2,-3.2757380307867789E-2,1.04172,1.5562180379877466E-2,-2.5756984776981184E-2,1.0455305615221844,1.6912207553272079E-2,-2.8142403794885196E-2,1.0455305615221844,1.6912207553272079E-2,-2.8142403794885196E-2]
[75,1.0554388216662982,2.3091050821747512E-2,-3.161768526718034E-2,1.03732,1.4594934886684254E-2,-2.2398165348473498E-2,1.0432828006276385,1.6306963387397969E-2,-2.6543001486803552E-2,1.0432828006276385,1.6306963387397969E-2,-2.6543001486803552E-2]
[100,1.048740890901712,1.8487280506871488E-2,-2.9704455788376771E-2,1.03731,1.2982859064695568E-2,-2.4015352992019956E-2,1.0395365324700621,1.5298223110941117E-2,-2.3873093449186866E-2,1.0395365324700621,1.5298223110941117E-2,-2.3873093449186866E-2]
[125,1.0471342740742975,1.8133773438124362E-2,-2.8483978621239192E-2,1.03729,1.3317880069511831E-2,-2.3657058068336623E-2,1.0394796360934762,1.4627796595180455E-2,-2.4493552790187501E-2,1.0394796360934762,1.4627796595180455E-2,-2.4493552790187501E-2]
[150,1.045527657246883,1.7780266369377233E-2,-2.7262653633957967E-2,1.0372600000000001,1.3652901074328096E-2,-2.3289134673863066E-2,1.0394227397168905,1.3957370079419794E-2,-2.5114832624054007E-2,1.0394227397168905,1.3957370079419794E-2,-2.5114832624054007E-2]
[200,1.0423144235920543,1.7073252231882982E-2,-2.4817456662813209E-2,1.0372600000000001,1.4322943083960624E-2,-2.2613169772440767E-2,1.0393089469637187,1.2616517047898472E-2,-2.6359860289102421E-2,1.0393089469637187,1.2616517047898472E-2,-2.6359860289102421E-2]
[250,1.0423144235920543,1.7073252231882982E-2,-2.4817456662813209E-2,1.0372600000000001,1.4322943083960624E-2,-2.2613169772440767E-2,1.0393089469637187,1.2616517047898472E-2,-2.6359860289102421E-2,1.0393089469637187,1.2616517047898472E-2,-2.6359860289102421E-2]
[300,1.0423144235920543,1.7073252231882982E-2,-2.4817456662813209E-2,1.0372600000000001,1.4322943083960624E-2,-2.2613169772440767E-2,1.0393089469637187,1.2616517047898472E-2,-2.6359860289102421E-2,1.0393089469637187,1.2616517047898472E-2,-2.6359860289102421E-2]
[350,1.0423144235920543,1.7073252231882982E-2,-2.4817456662813209E-2,1.0372600000000001,1.4322943083960624E-2,-2.2613169772440767E-2,1.0393089469637187,1.2616517047898472E-2,-2.6359860289102421E-2,1.0393089469637187,1.2616517047898472E-2,-2.6359860289102421E-2]
[400,1.0423144235920543,1.7073252231882982E-2,-2.4817456662813209E-2,1.0372600000000001,1.4322943083960624E-2,-2.2613169772440767E-2,1.0393089469637187,1.2616517047898472E-2,-2.6359860289102421E-2,1.0393089469637187,1.2616517047898472E-2,-2.6359860289102421E-2]
[450,1.0423144235920543,1.7073252231882982E-2,-2.4817456662813209E-2,1.0372600000000001,1.4322943083960624E-2,-2.2613169772440767E-2,1.0393089469637187,1.2616517047898472E-2,-2.6359860289102421E-2,1.0393089469637187,1.2616517047898472E-2,-2.6359860289102421E-2]
[500,1.0423144235920543,1.7073252231882982E-2,-2.4817456662813209E-2,1.0372600000000001,1.4322943083960624E-2,-2.2613169772440767E-2,1.0393089469637187,1.2616517047898472E-2,-2.6359860289102421E-2,1.0393089469637187,1.2616517047898472E-2,-2.6359860289102421E-2]
[]
["Table D2. Polyphase Induction Motor Coefficients, DOL (kW)"]
["kW","2 POLE",null,null,null,null,null,"6 POLE",null,null,"8 POLE"]
[null,"a","b","c","a","b","c","a","b","c","a","b","c"]
[1,1.1310058781971124,8.2927701937567114E-2,{"$f":"1-(B277/(C277+1))","v":-4.4396478336941714E-2},1.12218,8.6958015552371412E-2,{"$f":"1-(E277/(F277+1))","v":-3.2404181158486978E-2},1.1620703320180861,0.10880759983572502,{"$f":"1-(H277/(I277+1))","v":-4.803604537906514E-2},1.1620703320180861,0.10880759983572502,{"$f":"1-(K277/(L277+1))","v":-4.803604537906514E-2}]
[1.1000000000000001,1.1295920758106777,8.1427518485354566E-2,{"$f":"1-(B278/(C278+1))","v":-4.4537943137217706E-2},1.1209100000000001,8.5241401839162984E-2,{"$f":"1-(E278/(F278+1))","v":-3.2866971440998594E-2},1.1594489816189684,0.1065025473530712,{"$f":"1-(H278/(I278+1))","v":-4.7850259714768306E-2},1.1594489816189684,0.1065025473530712,{"$f":"1-(K278/(L278+1))","v":-4.7850259714768306E-2}]
[1.5,1.1239368662649387,7.5426784676504391E-2,-4.5107749109137618E-2,1.11582,7.8374946986329228E-2,-3.4723593234724293E-2,1.1489635800224975,9.7282337422455942E-2,-4.7099311487545092E-2,1.1489635800224975,9.7282337422455942E-2,-4.7099311487545092E-2]
[2.2000000000000002,1.1140402495598956,6.4925500511016573E-2,-4.6120361495062934E-2,1.1069100000000001,6.6358650993870144E-2,-3.8027870799693275E-2,1.1306141272286736,8.1146970043879219E-2,-4.5754331793379288E-2,1.1306141272286736,8.1146970043879219E-2,-4.5754331793379288E-2]
[3,1.1027298304684174,5.2924032893316222E-2,-4.7302365621041398E-2,1.09674,5.2625741288202639E-2,-4.1908778192912388E-2,1.109643324035732,6.2706550182648702E-2,-4.4167201044367443E-2,1.109643324035732,6.2706550182648702E-2,-4.4167201044367443E-2]
[3.7,1.0928332137633743,4.2422748727828412E-2,-4.8358945636083561E-2,1.0878300000000001,4.0609445295743563E-2,-4.5377787908542855E-2,1.091293871241908,4.6571182804071971E-2,-4.2732581569856265E-2,1.091293871241908,4.6571182804071971E-2,-4.2732581569856265E-2]
[4,1.0918916198050546,4.1672493843477376E-2,-4.8210091231537522E-2,1.0868599999999999,3.9712150797906763E-2,-4.5347021448109981E-2,1.0898240730561382,4.5342637752787122E-2,-4.2552014714500208E-2,1.0898240730561382,4.5342637752787122E-2,-4.2552014714500208E-2]
[5.5,1.0890168795695592,4.0004716906325871E-2,-4.7126865740598323E-2,1.08361,3.7588204220827467E-2,-4.4354586522822315E-2,1.0860274449115013,4.235914160562762E-2,-4.1893721235665371E-2,1.0860274449115013,4.235914160562762E-2,-4.1893721235665371E-2]
[7.5,1.0851838925888988,3.7781014323457186E-2,-4.5677149235905157E-2,1.07927,3.4756275451388395E-2,-4.3018559640233711E-2,1.0809652740519853,3.8381146742748271E-2,-4.1010112175878133E-2,1.0809652740519853,3.8381146742748271E-2,-4.1010112175878133E-2]
[11,1.0784761653727426,3.3889534803437003E-2,-4.3125139648291899E-2,1.07168,2.9800400104870031E-2,-4.0667686564177963E-2,1.0721064750478322,3.1419655732709426E-2,-3.9447395721986078E-2,1.0721064750478322,3.1419655732709426E-2,-3.9447395721986078E-2]
[15,1.0709319585815871,2.952451382107019E-2,-4.0219969708961578E-2,1.06311,2.4221069729251688E-2,-3.7969273841464979E-2,1.0621304448231348,2.360024037827517E-2,-3.7641847788762339E-2,1.0621304448231348,2.360024037827517E-2,-3.7641847788762339E-2]
[18.5,1.0695515450601762,2.9237342323511297E-2,-3.9169005125343936E-2,1.0604499999999999,2.2963257775349192E-2,-3.6645247949739224E-2,1.0597602736961069,2.2613878113680045E-2,-3.6324947643921579E-2,1.0597602736961069,2.2613878113680045E-2,-3.6324947643921579E-2]
[22,1.0681711315387656,2.8950170825952404E-2,-3.811745391064969E-2,1.0577799999999999,2.1705445821446699E-2,-3.5308174509679269E-2,1.0573901025690793,2.1627515849084927E-2,-3.5005504614146865E-2,1.0573901025690793,2.1627515849084927E-2,-3.5005504614146865E-2]
[30,1.0650159006326838,2.8293778831532085E-2,-3.571170278096969E-2,1.0516799999999999,1.8830447069669572E-2,-3.2242413862690444E-2,1.0519725685644441,1.9372973530010364E-2,-3.1980046441239196E-2,1.0519725685644441,1.9372973530010364E-2,-3.1980046441239196E-2]
[37,1.0622550735898624,2.7719435836414303E-2,-3.3604149682487039E-2,1.0463499999999999,1.6314823161864583E-2,-2.9553024470008848E-2,1.0472322263103886,1.7400249000820114E-2,-2.9321771189722234E-2,1.0472322263103886,1.7400249000820114E-2,-2.9321771189722234E-2]
[45,1.0593713869141383,2.5794068781420033E-2,-3.2733000857185779E-2,1.0443,1.5541435168227209E-2,-2.8318455393214759E-2,1.0454823521732397,1.6899226445156817E-2,-2.8108120239212608E-2,1.0454823521732397,1.6899226445156817E-2,-2.8108120239212608E-2]
[55,1.0557800031261564,2.3325559229207687E-2,-3.1714681221677088E-2,1.0419400000000001,1.467705134946652E-2,-2.6868596874518147E-2,1.0434736293005444,1.6358346940354217E-2,-2.6678860307309815E-2,1.0434736293005444,1.6358346940354217E-2,-2.6678860307309815E-2]
[75,1.0487064326319551,1.8479698585825974E-2,-2.9678288225184479E-2,1.03732,1.2990044501796185E-2,-2.4017961114484399E-2,1.0395353121724409,1.5283843989959654E-2,-2.3886392289249381E-2,1.0395353121724409,1.5283843989959654E-2,-2.3886392289249381E-2]
[90,1.0474142475160721,1.8195376546619169E-2,-2.8696723283652803E-2,1.03731,1.3259498393069318E-2,-2.3735777108502054E-2,1.039489551011648,1.4744626953154833E-2,-2.4385370862018307E-2,1.039489551011648,1.4744626953154833E-2,-2.4385370862018307E-2]
[110,1.0456913340282281,1.7816280494343428E-2,-2.7387116975910564E-2,1.03729,1.3618770248100166E-2,-2.335318804929587E-2,1.0394285361305908,1.4025670904081739E-2,-2.5051501116200026E-2,1.0394285361305908,1.4025670904081739E-2,-2.5051501116200026E-2]
[132,1.0437961291916,1.7399274836840117E-2,-2.5945422812487351E-2,1.03728,1.4013969288634097E-2,-2.2944487370019084E-2,1.0393614197614278,1.3234819250101334E-2,-2.5785336246797019E-2,1.0393614197614278,1.3234819250101334E-2,-2.5785336246797019E-2]
[150,1.0423144235920543,1.7073252231882982E-2,-2.4817456662813209E-2,1.0372600000000001,1.4322943083960624E-2,-2.2613169772440767E-2,1.0393089469637187,1.2616517047898472E-2,-2.6359860289102421E-2,1.0393089469637187,1.2616517047898472E-2,-2.6359860289102421E-2]
[160,1.0423144235920543,1.7073252231882982E-2,-2.4817456662813209E-2,1.0372600000000001,1.4322943083960624E-2,-2.2613169772440767E-2,1.0393089469637187,1.2616517047898472E-2,-2.6359860289102421E-2,1.0393089469637187,1.2616517047898472E-2,-2.6359860289102421E-2]
[185,1.0423144235920543,1.7073252231882982E-2,-2.4817456662813209E-2,1.0372600000000001,1.4322943083960624E-2,-2.2613169772440767E-2,1.0393089469637187,1.2616517047898472E-2,-2.6359860289102421E-2,1.0393089469637187,1.2616517047898472E-2,-2.6359860289102421E-2]
[200,1.0423144235920543,1.7073252231882982E-2,-2.4817456662813209E-2,1.0372600000000001,1.4322943083960624E-2,-2.2613169772440767E-2,1.0393089469637187,1.2616517047898472E-2,-2.6359860289102421E-2,1.0393089469637187,1.2616517047898472E-2,-2.6359860289102421E-2]
[220,1.0423144235920543,1.7073252231882982E-2,-2.4817456662813209E-2,1.0372600000000001,1.4322943083960624E-2,-2.2613169772440767E-2,1.0393089469637187,1.2616517047898472E-2,-2.6359860289102421E-2,1.0393089469637187,1.2616517047898472E-2,-2.6359860289102421E-2]
[250,1.0423144235920543,1.7073252231882982E-2,-2.4817456662813209E-2,1.0372600000000001,1.4322943083960624E-2,-2.2613169772440767E-2,1.0393089469637187,1.2616517047898472E-2,-2.6359860289102421E-2,1.0393089469637187,1.2616517047898472E-2,-2.6359860289102421E-2]
[300,1.0423144235920543,1.7073252231882982E-2,-2.4817456662813209E-2,1.0372600000000001,1.4322943083960624E-2,-2.2613169772440767E-2,1.0393089469637187,1.2616517047898472E-2,-2.6359860289102421E-2,1.0393089469637187,1.2616517047898472E-2,-2.6359860289102421E-2]
[]
[]
["10 CFR 431.25 TABLE 5 – NOMINAL FULL-LOAD EFFICIENCIES OF NEMA DESIGN A, NEMA DESIGN B AND IEC DESIGN N MOTORS (EXCLUDING FIRE PUMP ELECTRIC MOTORS) AT 60 HZ"]
[]
["Nominal Full Load Motor Effciency"]
["Motor Horsepower","4 pole"]
[null,"Enclosed","Open"]
[1,0.85499999999999998,0.85499999999999998]
[1.5,0.86499999999999999,0.86499999999999999]
[2,0.86499999999999999,0.86499999999999999]
[3,0.89500000000000002,0.89500000000000002]
[5,0.89500000000000002,0.89500000000000002]
[7.5,0.91700000000000004,0.91]
[10,0.91700000000000004,0.91700000000000004]
[15,0.92400000000000004,0.93]
[20,0.93,0.93]
[25,0.93599999999999994,0.93599999999999994]
[30,0.93599999999999994,0.94099999999999995]
[40,0.94099999999999995,0.94099999999999995]
[50,0.94499999999999995,0.94499999999999995]
[60,0.95,0.95]
[75,0.95400000000000007,0.95]
[100,0.95400000000000007,0.95400000000000007]
[125,0.95400000000000007,0.95400000000000007]
[150,0.95799999999999996,0.95799999999999996]
[200,0.96200000000000008,0.95799999999999996]
[250,0.96200000000000008,0.95799999999999996]
[300,0.96200000000000008,0.95799999999999996]
[350,0.96200000000000008,0.95799999999999996]
[400,0.96200000000000008,0.95799999999999996]
[450,0.96200000000000008,0.96200000000000008]
[500,0.96200000000000008,0.96200000000000008]
[]
["DOE Term Sheet: Appendix E—Air Over Motor (AO) Full Load efficiency "]
["Default Open AO Full Load Efficiency"]
["Motor Horsepower","Pole configurations"]
[null,2,4,6,8]
[1,0.72,0.755,0.7,0.7]
[1.5,0.8,0.77,0.77,0.72]
[2,0.81499999999999995,0.77,0.78500000000000003,0.82499999999999996]
[3,0.81499999999999995,0.81499999999999995,0.8,0.84]
[5,0.82499999999999996,0.81499999999999995,0.81499999999999995,0.85499999999999998]
[7.5,0.85499999999999998,0.86499999999999999,0.88500000000000001,0.88500000000000001]
[10,0.86499999999999999,0.875,0.90200000000000002,0.89500000000000002]
[15,0.875,0.89500000000000002,0.90200000000000002,0.89500000000000002]
[20,0.88500000000000001,0.89500000000000002,0.91,0.90200000000000002]
[25,0.89500000000000002,0.90200000000000002,0.91700000000000004,0.90200000000000002]
[30,0.89500000000000002,0.92400000000000004,0.92400000000000004,0.89500000000000002]
[40,0.90200000000000002,0.92400000000000004,0.93,0.89500000000000002]
[50,0.91,0.93,0.93,0.90200000000000002]
[60,0.91700000000000004,0.93599999999999994,0.93599999999999994,0.91]
[75,0.91700000000000004,0.93599999999999994,0.93599999999999994,0.92400000000000004]
[100,0.91700000000000004,0.94099999999999995,0.94099999999999995,0.92400000000000004]
[125,0.92400000000000004,0.94099999999999995,0.94099999999999995,0.92400000000000004]
[150,0.92400000000000004,0.94499999999999995,0.94499999999999995,0.92400000000000004]
[200,0.93599999999999994,0.94499999999999995,0.94499999999999995,0.92400000000000004]
[250,0.93599999999999994,0.94499999999999995,0.95,0.93599999999999994]
[]
["Default TEAO Full Load Efficiency"]
["Motor Horsepower","Pole configurations"]
[null,2,4,6,8]
[1,0.72,0.755,0.72,0.7]
[1.5,0.8,0.77,0.78500000000000003,0.74]
[2,0.81499999999999995,0.77,0.8,0.8]
[3,0.82499999999999996,0.81499999999999995,0.81499999999999995,0.81499999999999995]
[5,0.85499999999999998,0.81499999999999995,0.81499999999999995,0.82499999999999996]
[7.5,0.86499999999999999,0.875,0.89500000000000002,0.85499999999999998]
[10,0.875,0.875,0.89500000000000002,0.88500000000000001]
[15,0.88500000000000001,0.88500000000000001,0.90200000000000002,0.88500000000000001]
[20,0.88500000000000001,0.89500000000000002,0.90200000000000002,0.89500000000000002]
[25,0.89500000000000002,0.90200000000000002,0.91700000000000004,0.89500000000000002]
[30,0.89500000000000002,0.91700000000000004,0.91700000000000004,0.89500000000000002]
[40,0.90200000000000002,0.92400000000000004,0.93,0.89500000000000002]
[50,0.91,0.93,0.93,0.90200000000000002]
[60,0.91700000000000004,0.93599999999999994,0.93599999999999994,0.90200000000000002]
[75,0.91700000000000004,0.94099999999999995,0.93599999999999994,0.91700000000000004]
[100,0.92400000000000004,0.94099999999999995,0.94099999999999995,0.91700000000000004]
[125,0.93599999999999994,0.94099999999999995,0.94099999999999995,0.92400000000000004]
[150,0.93599999999999994,0.94499999999999995,0.95,0.92400000000000004]
[200,0.94099999999999995,0.95,0.95,0.93]
[250,0.94499999999999995,0.95,0.95,0.93599999999999994]
[]
[]
[" EISA 2007 Nominal ODP Motor Effciency"]
["Motor Horsepower","Pole Configuration"]
[null,2,4,6,8]
[1,0.77,0.85499999999999998,0.82499999999999996,0.755]
[1.5,0.84,0.86499999999999999,0.86499999999999999,0.77]
[2,0.85499999999999998,0.86499999999999999,0.875,0.86499999999999999]
[3,0.85499999999999998,0.89500000000000002,0.88500000000000001,0.875]
[5,0.86499999999999999,0.89500000000000002,0.89500000000000002,0.88500000000000001]
[7.5,0.88500000000000001,0.91,0.90200000000000002,0.89500000000000002]
[10,0.89500000000000002,0.91700000000000004,0.91700000000000004,0.90200000000000002]
[15,0.90200000000000002,0.93,0.91700000000000004,0.90200000000000002]
[20,0.91,0.93,0.92400000000000004,0.91]
[25,0.91700000000000004,0.93599999999999994,0.93,0.91]
[30,0.91700000000000004,0.94099999999999995,0.93599999999999994,0.91700000000000004]
[40,0.92400000000000004,0.94099999999999995,0.94099999999999995,0.91700000000000004]
[50,0.93,0.94499999999999995,0.94099999999999995,0.92400000000000004]
[60,0.93599999999999994,0.95,0.94499999999999995,0.93]
[75,0.93599999999999994,0.95,0.94499999999999995,0.94099999999999995]
[100,0.93599999999999994,0.95400000000000007,0.95,0.94099999999999995]
[125,0.94099999999999995,0.95400000000000007,0.95,0.94099999999999995]
[150,0.94099999999999995,0.95799999999999996,0.95400000000000007,0.94099999999999995]
[200,0.95,0.95799999999999996,0.95400000000000007,0.94099999999999995]
[250,0.95,0.95799999999999996,0.95400000000000007,0.95]
[300,0.95400000000000007,0.95799999999999996]
[350,0.95400000000000007,0.95799999999999996]
[400,0.95799999999999996,0.95799999999999996]
[450,0.95799999999999996,0.96200000000000008]
[500,0.95799999999999996,0.96200000000000008]
[]
[]
["EISA 2007 Nominal TEFC Motor Effciency"]
["Motor Horsepower","Pole Configuration"]
[null,2,4,6,8]
[1,0.77,0.85499999999999998,0.82499999999999996,0.72]
[1.5,0.84,0.86499999999999999,0.875,0.755]
[2,0.85499999999999998,0.86499999999999999,0.88500000000000001,0.81499999999999995]
[3,0.86499999999999999,0.89500000000000002,0.89500000000000002,0.82499999999999996]
[5,0.88500000000000001,0.89500000000000002,0.89500000000000002,0.84]
[7.5,0.89500000000000002,0.91700000000000004,0.91,0.84]
[10,0.90200000000000002,0.91700000000000004,0.91,0.875]
[15,0.91,0.92400000000000004,0.91700000000000004,0.875]
[20,0.91,0.93,0.91700000000000004,0.88500000000000001]
[25,0.91700000000000004,0.93599999999999994,0.93,0.88500000000000001]
[30,0.91700000000000004,0.93599999999999994,0.93,0.90200000000000002]
[40,0.92400000000000004,0.94099999999999995,0.94099999999999995,0.90200000000000002]
[50,0.93,0.94499999999999995,0.94099999999999995,0.91]
[60,0.93599999999999994,0.95,0.94499999999999995,0.91]
[75,0.93599999999999994,0.95400000000000007,0.94499999999999995,0.92400000000000004]
[100,0.94099999999999995,0.95400000000000007,0.95,0.92400000000000004]
[125,0.95,0.95400000000000007,0.95,0.93]
[150,0.95,0.95799999999999996,0.95799999999999996,0.93]
[200,0.95400000000000007,0.96200000000000008,0.95799999999999996,0.93599999999999994]
[250,0.95799999999999996,0.96200000000000008,0.95799999999999996,0.94099999999999995]
[300,0.95799999999999996,0.96200000000000008]
[350,0.95799999999999996,0.96200000000000008]
[400,0.95799999999999996,0.96200000000000008]
[450,0.95799999999999996,0.96200000000000008]
[500,0.95799999999999996,0.96200000000000008]
[]
[]
["DOE Term Sheet: Default Control Losses Determination: Recommendation 15"]
["Motor Horsepower (hp)","Coefficients for Motor and Control Part Load Loss Factor (zi) "]
[null,"a","b","c"]
["≤5 ",-0.46579999999999999,1.4964999999999999,0.53029999999999999]
[">5 and ≤20 ",-1.3198000000000001,2.9550999999999998,0.1052]
[">20 and ≤50 ",-1.5122,3.0777000000000001,0.1847]
[">50 ",-0.89139999999999997,2.8845999999999998,0.26250000000000001]
[]
["Motor Horsepower","a","b","c"]
[1,-0.46579999999999999,1.4964999999999999,0.53029999999999999]
[1.5,-0.46579999999999999,1.4964999999999999,0.53029999999999999]
[2,-0.46579999999999999,1.4964999999999999,0.53029999999999999]
[3,-0.46579999999999999,1.4964999999999999,0.53029999999999999]
[5,-0.46579999999999999,1.4964999999999999,0.53029999999999999]
[7.5,-1.3198000000000001,2.9550999999999998,0.1052]
[10,-1.3198000000000001,2.9550999999999998,0.1052]
[15,-1.3198000000000001,2.9550999999999998,0.1052]
[20,-1.3198000000000001,2.9550999999999998,0.1052]
[25,-1.5122,3.0777000000000001,0.1847]
[30,-1.5122,3.0777000000000001,0.1847]
[40,-1.5122,3.0777000000000001,0.1847]
[50,-1.5122,3.0777000000000001,0.1847]
[60,-0.89139999999999997,2.8845999999999998,0.26250000000000001]
[75,-0.89139999999999997,2.8845999999999998,0.26250000000000001]
[100,-0.89139999999999997,2.8845999999999998,0.26250000000000001]
[125,-0.89139999999999997,2.8845999999999998,0.26250000000000001]
[150,-0.89139999999999997,2.8845999999999998,0.26250000000000001]
[200,-0.89139999999999997,2.8845999999999998,0.26250000000000001]
[250,-0.89139999999999997,2.8845999999999998,0.26250000000000001]
[300,-0.89139999999999997,2.8845999999999998,0.26250000000000001]
[350,-0.89139999999999997,2.8845999999999998,0.26250000000000001]
[400,-0.89139999999999997,2.8845999999999998,0.26250000000000001]
[450,-0.89139999999999997,2.8845999999999998,0.26250000000000001]
[500,-0.89139999999999997,2.8845999999999998,0.26250000000000001]

{"sheet":"PSW_Sheet","index":5,"n_rows":0,"n_cols":0,"rows_kept":0,"cut":false,"hidden":true,"merged":[]}